program: Gaussian 09
title: 000135715
version: EM64L-G09RevD.01
frameworkgroup: C1[X(C16H10INO3S)]
method: RPBEPBE
basis: SDD
operation: Freq
keyword: #p
keyword: freq=noraman
keyword: PBEPBE/SDD
title: #p freq=noraman PBEPBE/SDD
converged: YES YES NO NO
title: Mulliken charges:
elementType: I S O O O N C C C C C C C C C C C C C C C C H H H H H H H H H H
charge: 0.135948 0.966933 -0.551222 -0.505383 -0.482535 -0.699246 -0.561263 0.308761 0.378258 0.248029 0.216584 0.847862 -0.304621 -0.452987 -0.468450 -0.606115 -0.249777 -0.633530 -0.402717 -0.093721 0.559663 -0.451652 0.264968 0.259821 0.307643 0.243622 0.249095 0.244169 0.222830 0.312442 0.312770 0.383821
chargesum: 0.00000
title: Mulliken charges with hydrogens summed into heavy atoms:
elementType: I S O O O N C C C C C C C C C C C C C C C C
charge: 0.135948 0.966933 -0.167401 -0.505383 -0.482535 -0.074034 -0.561263 0.308761 0.378258 0.248029 0.216584 0.847862 -0.304621 -0.188018 -0.208629 -0.606115 0.057866 -0.389908 -0.153622 0.150448 0.559663 -0.228821
polarizability: 4.77970559e+02 8.29995953e+00 2.64390402e+02 1.59555882e+00 -1.07735805e+00 1.02862679e+02
1716.lowfreq: -5.6448 -0.0012 -0.0009 0.0018 2.6262 11.8889 25.1691 45.0349 87.2592
frequency: 24.4679 45.0329 87.1412 103.6880 109.4307 112.5459 121.9437 129.8870 147.1645 171.0934 192.9304 211.4846 235.9799 243.1918 258.2457 304.7905 319.7826 356.7387 359.9221 368.1241 382.4768 383.1935 398.7259 430.4702 447.9917 467.4435 491.2171 499.4983 538.3644 553.1156 566.8933 574.9947 603.0996 614.2456 662.8717 680.0357 690.3000 727.6085 782.0150 789.1128 822.4328 834.9316 838.4578 857.5120 871.3840 872.7296 909.0912 917.2484 954.0098 954.6108 964.1933 972.2668 984.1292 1029.3899 1053.3183 1058.0405 1094.4993 1114.5273 1121.8037 1161.6258 1211.7957 1231.2571 1242.9681 1282.2292 1310.2878 1329.0984 1344.5801 1370.3622 1393.8864 1422.6417 1425.8813 1462.1102 1475.1089 1502.9833 1555.0731 1585.8994 1610.5534 1627.1358 1637.1658 1646.4818 3123.7747 3125.3108 3137.7079 3145.1803 3148.2250 3159.3699 3168.9938 3482.6915 3564.2024 3704.0178
redmass: 7.1959 6.8866 7.7687 4.7364 8.7056 11.8038 8.1400 7.7437 1.5782 3.5429 6.5273 5.4427 8.8704 5.4895 4.6731 8.0121 7.5822 5.4725 4.1883 4.5921 3.8707 1.1877 1.3018 7.9386 3.0826 3.3255 6.4248 5.8218 7.8981 13.3042 5.2797 5.9470 3.5835 7.2253 3.4982 5.5523 6.9646 7.3910 2.2570 5.9805 1.5636 2.4958 7.4502 6.6930 1.5061 2.0078 2.2637 5.2303 9.3526 1.4249 1.4448 3.4055 1.4095 1.7092 1.8139 1.7555 3.0496 1.8838 1.8614 1.5481 1.5859 2.6481 1.8774 2.3977 1.8092 1.9763 3.5152 4.1702 3.6834 4.1658 3.6171 4.8110 4.0193 5.1216 7.3031 7.0490 7.7125 7.0903 3.8703 1.3654 1.0917 1.0876 1.0891 1.0903 1.0962 1.0957 1.0954 1.0662 1.0451 1.1040
irintensity: 0.6090 0.7088 1.2895 1.2212 1.0051 7.3043 3.5576 3.1084 84.7998 9.7785 5.4078 0.3401 4.2808 1.9456 30.0618 5.3862 7.0162 10.8476 7.3569 4.1481 53.5915 10.1080 305.5964 41.0565 2.4740 0.4448 6.7443 11.5324 9.6251 120.9782 4.0222 6.4354 2.9159 8.1603 0.2858 15.5538 10.7238 34.0610 0.1978 0.3517 54.2729 37.4465 72.7955 4.5719 98.8395 0.2286 0.0195 1.9209 69.6989 0.3741 0.1990 11.8130 0.6965 6.3480 35.2305 77.6613 29.3755 1.0439 13.7174 24.1495 23.4337 13.8064 6.7846 44.4466 8.2038 2.8476 56.3191 26.0298 22.5507 71.7194 8.6223 7.3370 90.4382 111.6260 3.8040 11.5034 8.6844 118.0495 47.5031 393.5526 9.9000 20.6873 13.6928 1.4275 32.6094 9.4557 7.7234 46.7427 165.0376 23.0672
temp: 298.150 k
press: 1.00000 atm
elementType: 53 16 8 8 8 7 6 6 6 6 6 6 6 6 6 6 6 6 6 6 6 6 1 1 1 1 1 1 1 1 1 1
symmnumber: 1
zpe: 574210.1 jmol-1
zpe.correction: 0.218705 hartree
zpe.thermalcorrener: 0.238201 hartree
zpe.thermalcorrenthalpy: 0.239145 hartree
zpe.thermalcorrgfe: 0.170033 hartree
zpe.sumelectzpe: -1304.018029 hartree
zpe.sumelectthermal: -1303.998533 hartree
zpe.sumelectthermalent: -1303.997589 hartree
zpe.sumelectthermalfe: -1304.066701 hartree
dipole: 8.8103 -2.1912 1.1276
dipole: 9.1485
quadrupole: -98.3230 -142.5346 -159.9792
quadrupole: 15.6621 -7.6178 1.4250
quadrupole: 35.2893 -8.9223 -26.3669 15.6621 -7.6178 1.4250
hfenergy: -1304.2367342 hartree
pointgroup: C01 [X(C16H10I1N1O3S1)]
dipole: -3.5654221 -0.2761921 -0.4078253 debye
polarizability: 469.5873505|-42.206516|272.6455291|-3.3529094|4.6817585|102.990761 unknown
InChI: InChI=1S/C16H10INO3S/c17-13-5-3-10-9-2-1-8(18)7-12(9)11-4-6-14(22(19,20)21)16(13)15(10)11/h1-7,19H,18H2
charge 0 multiplicity 1
32 atoms
I  3.943332 -2.420905 -0.11735
S  3.888453 1.299607 0.069138
O  4.279172 0.655518 -1.622962
O  4.058562 2.909371 0.020135
O  4.7263 0.507956 1.199528
N  -5.817114 1.528515 0.046306
C  -0.042771 -0.308215 -0.008405
C  -0.794829 0.920651 0.020875
C  -0.956939 -1.419236 -0.034246
C  -2.23089 0.561149 0.016636
C  -2.32455 -0.871191 -0.016358
C  1.39507 -0.409196 -0.018367
C  2.015925 0.898058 0.016415
C  -0.11963 2.136934 0.041931
C  -0.432426 -2.709801 -0.070635
C  1.887743 -1.77717 -0.065208
C  1.303896 2.103967 0.038334
C  -3.373308 1.371541 0.037781
C  -3.593189 -1.481113 -0.027611
C  0.985596 -2.859796 -0.087464
C  -4.661992 0.7495 0.026072
C  -4.75241 -0.676495 -0.0066
H  -0.638292 3.099908 0.059647
H  -1.065297 -3.602328 -0.090237
H  1.870569 3.041518 0.049025
H  -3.296233 2.465102 0.062613
H  -3.696609 -2.571415 -0.052884
H  1.394212 -3.873781 -0.121093
H  -5.742517 -1.147553 -0.015572
H  -5.763987 2.542734 0.068598
H  -6.736822 1.097225 0.038251
H  5.264175 0.479639 -1.657195
