program: Gaussian 09
title: 000135676
version: EM64L-G09RevD.01
frameworkgroup: C1[X(C20H21N3O)]
method: RPBEPBE
basis: SDD
operation: Freq
keyword: #p
keyword: freq=noraman
keyword: PBEPBE/SDD
title: #p freq=noraman PBEPBE/SDD
converged: YES YES NO NO
title: Mulliken charges:
elementType: O N N N C C C C C C C C C C C C C C C C C C C C H H H H H H H H H H H H H H H H H H H H H
charge: -0.298441 -0.083310 -0.382678 -0.180430 -0.333259 -0.397152 -0.093448 0.153327 0.465324 0.115682 0.075377 -0.355345 -0.332627 -0.418224 -0.311389 -0.247006 0.345327 -0.617745 -0.618129 -0.378133 -0.363569 -0.241221 -0.237088 -0.235190 0.249783 0.168535 0.211143 0.257797 0.389870 0.288529 0.246328 0.239471 0.240488 0.236379 0.225497 0.181374 0.222687 0.218973 0.235901 0.184578 0.230807 0.246171 0.229825 0.231552 0.233658
chargesum: 0.00000
title: Mulliken charges with hydrogens summed into heavy atoms:
elementType: O N N N C C C C C C C C C C C C C C C C C C C C
charge: -0.298441 -0.083310 0.007192 -0.180430 0.085058 0.071788 -0.093448 0.153327 0.465324 0.115682 0.075377 -0.066816 -0.086299 -0.178753 -0.070901 -0.010627 0.345327 0.011813 0.021324 -0.147327 -0.117399 -0.011396 -0.005536 -0.001532
polarizability: 2.91725776e+02 -1.97080548e+01 3.67434563e+02 5.09002074e+00 -7.25414312e+00 1.20621608e+02
1716.lowfreq: -9.2353 -7.2416 -2.9934 -0.9359 -0.0007 -0.0006 0.0001 26.5491 29.5034
frequency: -7.1968 26.4441 29.4737 48.8879 53.4708 68.7393 76.0873 88.0750 121.7185 145.4660 176.8321 185.6530 209.6765 216.9049 229.0016 244.1292 270.5908 283.7927 316.8948 341.2361 354.8118 388.4098 404.6826 407.8886 415.6601 428.6547 457.2843 491.7075 508.0387 523.3594 555.6821 561.6955 576.1100 614.8118 649.2530 674.1890 692.6022 701.1656 733.6321 739.5181 776.8696 777.9542 801.2351 823.9796 827.6779 846.9326 853.2413 861.0671 863.2009 914.7778 933.3610 952.0101 980.3556 982.2638 985.1636 990.6230 1001.6588 1008.4371 1015.9034 1020.0807 1033.8132 1039.4693 1053.8515 1062.6017 1078.7495 1082.0769 1088.3563 1092.0661 1138.4318 1155.1024 1168.8123 1174.3754 1190.0674 1193.5438 1210.1049 1242.1273 1261.6277 1262.9164 1272.4171 1291.6892 1296.4226 1303.3402 1322.4742 1323.5224 1347.2291 1367.3482 1381.6422 1401.2678 1418.3396 1421.9530 1427.1897 1438.7879 1445.7630 1450.1703 1461.7818 1466.4866 1475.2870 1478.4305 1481.1732 1485.1333 1505.3625 1548.9733 1557.8391 1585.4338 1587.6503 1600.2550 1611.5756 1622.9666 2825.2316 2834.1820 2857.3599 3012.7086 3017.8540 3022.9095 3046.9921 3077.2542 3081.5919 3087.9614 3126.2764 3127.0287 3132.3102 3133.7925 3141.1344 3145.9946 3146.4938 3155.2304 3163.7985 3168.0724 3172.8325
redmass: 3.8722 4.6682 2.7206 4.1466 4.7366 5.1134 5.8878 2.2449 5.0585 4.0353 3.6759 3.4377 3.2959 1.1523 1.7320 2.4884 2.8650 5.4026 4.7187 5.6486 2.9582 4.0128 2.8369 3.0447 3.3381 3.5481 3.8315 4.3547 4.0285 4.2338 3.5537 6.4585 6.2188 6.4408 6.5208 4.1205 5.9063 1.7409 2.6065 3.4465 1.9296 1.6726 2.1405 2.7173 3.6461 4.3683 1.2862 2.1362 2.7852 1.1277 1.4266 1.3485 1.9965 2.7403 1.4203 3.8105 1.3372 1.3737 3.2704 2.9909 1.5774 2.7274 2.5805 2.5211 1.7942 1.9952 1.6090 1.4200 1.5161 1.4529 1.2528 1.0564 1.3518 1.4753 1.9594 1.9760 2.0492 2.2505 1.8781 2.0803 2.5813 1.4291 1.5399 1.3480 4.9021 1.3329 7.3863 5.0413 1.1410 2.5842 2.5638 1.1435 2.7316 1.1307 1.0529 1.0597 1.0561 1.0896 2.6347 1.0549 3.3042 2.7938 3.2237 5.4223 5.6988 5.4389 5.8430 6.2304 1.0688 1.0587 1.0586 1.0614 1.0723 1.0697 1.0871 1.1010 1.1005 1.1041 1.0881 1.0849 1.0885 1.0888 1.0867 1.0922 1.0911 1.0959 1.0983 1.1013 1.0957
irintensity: 0.3337 1.6158 0.1196 0.7131 0.3580 2.2296 2.4129 1.8697 0.5425 6.4457 0.4987 3.2273 1.3342 2.6199 0.0793 0.9755 4.0275 3.0888 0.4180 13.4737 11.6285 5.0082 0.2914 1.2406 0.5130 1.0380 6.1685 7.8191 8.8791 7.2510 5.1176 3.0066 5.4568 0.1236 6.9047 4.1044 4.0615 51.3881 3.4688 2.4098 79.2736 14.6480 2.0240 0.4296 10.0477 6.7300 3.1119 40.6297 31.4101 68.4827 1.6694 0.0549 2.4239 4.8497 1.1825 0.8839 0.1545 2.7244 12.4978 16.2972 25.6241 0.2860 11.9552 38.8588 10.1703 12.4637 11.0883 8.5171 3.7611 6.9234 0.1317 0.1338 14.9676 1.9329 5.4366 5.3911 8.2826 57.2538 1.1216 25.8257 25.2262 1.1758 6.1929 2.2834 5.5667 1.1379 3.4909 12.4897 3.4787 7.4648 22.0073 2.5925 26.7703 9.6497 13.7096 8.3581 24.0528 23.6609 24.6501 11.2781 15.8353 161.5047 211.6455 18.5493 55.7007 54.7974 19.8018 80.7908 67.6016 100.7114 217.0583 20.9511 42.9901 73.6115 6.9167 14.4206 59.0235 40.1829 8.8662 4.9119 11.4870 1.4185 529.0237 38.4629 10.1083 14.7043 27.5157 22.4945 9.6222
temp: 298.150 k
press: 1.00000 atm
elementType: 8 7 7 7 6 6 6 6 6 6 6 6 6 6 6 6 6 6 6 6 6 6 6 6 1 1 1 1 1 1 1 1 1 1 1 1 1 1 1 1 1 1 1 1 1
symmnumber: 1
zpe: 960673.3 jmol-1
zpe.correction: 0.365901 hartree
zpe.thermalcorrener: 0.386622 hartree
zpe.thermalcorrenthalpy: 0.387567 hartree
zpe.thermalcorrgfe: 0.315142 hartree
zpe.sumelectzpe: -1012.513114 hartree
zpe.sumelectthermal: -1012.492393 hartree
zpe.sumelectthermalent: -1012.491449 hartree
zpe.sumelectthermalfe: -1012.563873 hartree
dipole: 4.3423 4.3158 1.4854
dipole: 6.2999
quadrupole: -119.0163 -133.5932 -147.6287
quadrupole: -13.8118 -3.7084 -5.6589
quadrupole: 14.3965 -0.1804 -14.2160 -13.8118 -3.7084 -5.6589
hfenergy: -1012.8790152 hartree
pointgroup: C01 [X(C20H21N3O1)]
dipole: 1.7177598 1.7759808 0.1960607 debye
polarizability: 292.0774837|-20.0111155|355.8967617|3.4800603|-52.0835518|131.8077014 unknown
InChI: InChI=1S/C20H21N3O/c1-23(2)14-13-21-20(24)17-10-6-9-16-11-12-18(22-19(16)17)15-7-4-3-5-8-15/h3-12,21H,13-14H2,1-2H3
charge 0 multiplicity 1
45 atoms
O  -1.703394 -3.416407 -0.042912
N  -5.041847 -0.236902 0.049584
N  -1.409772 -1.170231 -0.61121
N  1.042339 -0.110956 -0.29527
C  -3.633028 -0.561668 0.360294
C  -2.825904 -0.935351 -0.911128
C  1.485668 -1.391123 0.008678
C  0.546818 -2.491064 0.068604
C  2.890008 -1.646227 0.268546
C  -0.950309 -2.395093 -0.192627
C  1.909436 0.927364 -0.350197
C  1.03048 -3.768238 0.391741
C  3.789474 -0.533457 0.197833
C  3.332207 -2.967243 0.588202
C  3.314679 0.738357 -0.10676
C  2.409728 -4.014001 0.650983
C  1.346828 2.273637 -0.653353
C  -5.214433 1.109585 -0.528132
C  -5.953184 -0.470672 1.187464
C  2.141229 3.289837 -1.251112
C  -0.011955 2.562913 -0.348729
C  1.590898 4.556771 -1.539895
C  -0.559543 3.830341 -0.631969
C  0.239203 4.83377 -1.230503
H  -3.610433 -1.436607 1.034124
H  -3.114557 0.280186 0.891746
H  -2.890299 -0.129684 -1.664598
H  -3.264215 -1.852089 -1.340212
H  -0.689452 -0.415711 -0.648714
H  0.292342 -4.576563 0.43616
H  4.854513 -0.696442 0.399893
H  4.397126 -3.142138 0.782745
H  3.992686 1.595313 -0.126706
H  2.739921 -5.028581 0.896907
H  -6.269542 1.25601 -0.821265
H  -4.935604 1.930735 0.183812
H  -4.597175 1.222902 -1.436144
H  -6.998422 -0.312706 0.864079
H  -5.857244 -1.515384 1.531016
H  -5.760069 0.202437 2.062163
H  3.182644 3.085948 -1.523577
H  -0.621697 1.791061 0.132483
H  2.213425 5.324843 -2.0118
H  -1.605348 4.039262 -0.380729
H  -0.186124 5.818665 -1.452412
