program: Gaussian 09
title: 000135690
version: EM64L-G09RevD.01
frameworkgroup: C1[X(C23H27N5O3)]
method: RPBEPBE
basis: SDD
operation: Freq
keyword: #p
keyword: freq=noraman
keyword: PBEPBE/SDD
title: #p freq=noraman PBEPBE/SDD
converged: YES YES NO NO
title: Mulliken charges:
elementType: O O O N N N N N C C C C C C C C C C C C C C C C C C C C C C C H H H H H H H H H H H H H H H H H H H H H H H H H H H
charge: -0.459112 -0.446550 -0.142930 0.022373 -0.104239 -0.317245 -0.059599 -0.065439 -0.362494 -0.364931 -0.366398 -0.370045 -0.300487 -0.322946 -0.459398 -0.363527 -0.395841 0.196822 0.169947 0.321957 0.306630 -0.045381 -0.040593 -0.320879 -0.315384 -0.374235 -0.372051 -0.246140 -0.248782 -0.261507 -0.263579 0.205579 0.239986 0.245542 0.214356 0.240542 0.198768 0.222468 0.236317 0.217278 0.231591 0.222774 0.198916 0.241883 0.210223 0.252508 0.218911 0.195325 0.259470 0.340028 0.244633 0.254640 0.269946 0.269257 0.232075 0.231280 0.238898 0.238786
chargesum: 0.00000
title: Mulliken charges with hydrogens summed into heavy atoms:
elementType: O O O N N N N N C C C C C C C C C C C C C C C C C C C C C C C
charge: -0.459112 -0.106523 -0.142930 0.022373 -0.104239 -0.317245 -0.059599 -0.065439 0.083071 0.094967 0.072912 0.088740 0.148382 0.098744 -0.007292 0.107893 0.058953 0.196822 0.169947 0.321957 0.306630 -0.045381 -0.040593 -0.076246 -0.060744 -0.104289 -0.102794 -0.014065 -0.017501 -0.022609 -0.024792
polarizability: 3.02755882e+02 5.90367184e+01 2.94220449e+02 3.26180017e+01 -1.01233743e+01 2.83557679e+02
1716.lowfreq: -2.0656 -0.0003 -0.0002 0.0004 6.8815 9.7197 12.3694 16.7660 33.4001
frequency: 12.2659 16.5104 33.0385 36.2697 44.5990 58.2983 59.3790 82.9648 89.0926 106.1318 117.8289 142.9191 156.0653 172.3085 200.6401 211.7301 222.2917 235.8747 261.5309 283.5478 292.7037 306.2424 313.6490 323.0502 327.8042 338.6724 347.7942 357.2377 361.9667 372.3342 393.6660 423.9754 440.3428 448.4887 458.8566 484.4493 493.1365 498.9507 507.2944 533.2005 537.6653 551.8235 577.9398 587.7258 617.2542 626.2296 654.5407 663.3425 698.5538 700.4609 726.1752 729.8772 740.3117 743.2464 758.2243 770.1135 772.4090 776.9352 794.5059 822.9769 850.4616 850.9155 869.6872 874.5870 876.2607 877.7797 910.4764 926.5668 928.2012 956.1033 958.1829 966.6183 969.1408 977.4466 987.5670 988.4996 992.1847 997.4230 1028.1143 1037.7630 1041.9192 1054.9547 1058.5465 1061.3113 1072.3768 1085.0257 1097.5781 1104.7342 1108.5047 1109.1027 1139.0274 1144.4934 1151.0669 1168.5329 1177.7527 1179.3157 1203.7539 1212.7426 1216.5175 1233.3770 1237.7848 1253.0354 1265.5400 1268.9086 1286.4668 1293.3564 1298.6484 1305.4036 1307.5098 1320.1678 1323.0847 1331.1508 1342.5482 1349.2558 1352.6426 1362.1143 1363.9770 1369.1925 1370.3636 1376.5328 1387.7681 1393.3658 1410.6105 1425.1750 1437.0745 1442.4924 1442.7035 1445.3140 1448.0645 1458.3756 1463.7314 1466.8243 1475.5241 1482.9534 1485.1127 1508.0959 1524.0119 1573.7732 1585.6861 1605.6510 1612.7896 2882.8833 2921.9121 2927.4585 2940.0547 2993.4909 2998.6236 3001.5845 3005.4216 3014.0880 3032.7632 3040.8169 3045.3916 3049.1815 3066.1073 3075.3101 3097.8679 3103.3695 3113.9796 3133.0851 3134.3257 3147.3847 3148.0867 3158.0675 3159.2039 3171.9335 3172.7432 3565.7134
redmass: 6.8611 6.4067 3.9685 5.6264 4.9133 4.8559 3.4748 4.4496 3.3576 4.4970 5.1379 3.6092 5.9543 3.4976 4.0153 3.2361 3.5796 2.9956 4.1509 2.9897 3.5302 1.2690 4.9694 2.8033 4.2531 3.5277 4.1050 7.2221 3.1081 2.4325 3.3946 2.1319 3.2766 3.2213 3.5958 3.1394 3.1748 4.4846 4.2388 5.1589 3.6467 4.9835 3.9282 7.3064 4.7553 2.8173 5.9538 6.2179 4.1949 6.2833 2.6764 5.6412 3.8186 3.8180 3.6259 1.4074 1.5912 1.7672 1.4698 1.8035 10.2554 4.0128 1.5825 1.5142 2.7740 2.9821 2.7710 2.5024 9.7793 1.4127 1.4100 5.5056 2.5474 3.0744 1.3468 1.3529 2.2049 2.5013 1.7521 2.9350 2.5565 2.1891 2.1794 2.2645 2.0868 2.6364 2.9511 2.5654 2.1769 2.1378 1.9125 2.2146 2.4285 1.3225 1.0601 1.0641 1.1471 1.4534 2.4474 1.6631 1.6034 1.2254 1.7128 1.4262 1.3918 1.5526 1.5261 1.4127 1.3337 1.7493 5.1807 1.2904 1.3059 1.3457 1.3660 4.4827 1.4892 1.7167 1.3092 4.0154 1.3131 1.3933 2.2848 1.0939 1.0937 1.7353 1.5142 2.7942 1.0929 1.1069 2.2417 1.1698 1.1197 1.1575 1.0809 4.3386 4.9549 6.9918 7.6658 6.2646 6.3138 1.0709 1.0677 1.0669 1.0687 1.0632 1.0606 1.0611 1.0602 1.0622 1.0897 1.0918 1.0922 1.0955 1.0931 1.1026 1.1049 1.1030 1.1017 1.0859 1.0858 1.0894 1.0895 1.0945 1.0942 1.1007 1.1007 1.0666
irintensity: 0.2316 0.3394 0.2797 0.8026 1.2464 0.3906 11.7343 1.7092 2.2764 4.5914 1.1346 0.6497 1.0987 4.4512 6.9839 2.8221 4.4056 3.0471 0.5876 1.6813 2.6396 125.6146 1.6182 35.5139 1.7644 1.0024 7.6168 1.3104 5.6414 23.1260 1.3099 1.9473 11.1297 2.0373 0.0583 17.6218 4.5028 1.2013 2.4274 3.4897 3.1940 0.7895 2.0894 17.4044 2.6416 4.0300 5.0705 0.8773 2.0797 0.8147 19.1169 3.0302 3.4741 2.6851 19.6241 137.4845 25.8717 0.3109 5.6673 4.8220 22.1030 14.8166 0.1705 0.9834 0.7167 7.8577 2.5283 25.6152 11.8363 2.4124 4.1781 4.1269 14.5295 108.9545 0.5470 1.4285 16.0922 6.8706 7.3530 5.1150 6.1170 3.0621 4.5006 3.2394 40.2440 0.7034 5.9129 3.9842 8.9255 13.6046 1.6596 36.4833 25.8157 8.6448 0.4477 1.8123 2.3459 53.1549 56.9059 23.1666 4.1720 0.5007 2.0242 4.8621 10.2999 7.4078 27.5642 2.4364 17.8031 63.3447 5.6325 8.5922 9.6433 10.9925 2.5940 21.2892 1.1102 2.2264 13.0917 11.9873 3.4254 0.6859 16.5194 0.8236 7.2520 11.3683 21.3155 188.7303 21.7903 8.1779 26.3488 20.6426 1.3898 27.8375 6.6975 25.3281 17.7500 14.6877 25.6821 45.2240 22.1608 66.7547 46.0969 40.9560 57.4709 38.6824 0.3286 2.9770 29.6139 40.6892 6.3259 21.2533 26.5995 55.6286 18.6421 0.5506 8.4850 44.5825 13.1085 3.9630 3.5526 8.7579 3.4186 6.9969 20.1211 22.6340 16.1556 9.4456
temp: 298.150 k
press: 1.00000 atm
elementType: 8 8 8 7 7 7 7 7 6 6 6 6 6 6 6 6 6 6 6 6 6 6 6 6 6 6 6 6 6 6 6 1 1 1 1 1 1 1 1 1 1 1 1 1 1 1 1 1 1 1 1 1 1 1 1 1 1 1
symmnumber: 1
zpe: 1234639.8 jmol-1
zpe.correction: 0.470249 hartree
zpe.thermalcorrener: 0.497447 hartree
zpe.thermalcorrenthalpy: 0.498391 hartree
zpe.thermalcorrgfe: 0.410872 hartree
zpe.sumelectzpe: -1389.628090 hartree
zpe.sumelectthermal: -1389.600892 hartree
zpe.sumelectthermalent: -1389.599948 hartree
zpe.sumelectthermalfe: -1389.687467 hartree
dipole: -2.0839 -2.9162 7.2151
dipole: 8.0563
quadrupole: -190.2892 -180.3503 -188.4852
quadrupole: 5.7635 5.3981 -0.6672
quadrupole: -3.9143 6.0246 -2.1103 5.7635 5.3981 -0.6672
hfenergy: -1390.098339 hartree
pointgroup: C01 [X(C23H27N5O3)]
dipole: -0.7847846 -1.0093754 2.9002851 debye
polarizability: 302.4217755|60.5628351|294.0769126|29.5197567|-10.9655093|284.0353222 unknown
InChI: InChI=1S/C23H27N5O3/c29-17-16-28(30)14-12-26(13-15-28)10-5-11-27-20-8-3-1-6-18(20)22-23(25-31-24-22)19-7-2-4-9-21(19)27/h1-4,6-9,29H,5,10-17H2
charge 0 multiplicity 1
58 atoms
O  4.986329 -1.567673 -1.319674
O  7.783357 1.28729 -0.360109
O  -1.983886 1.845535 -3.227182
N  4.557119 -0.739564 -0.234956
N  1.718955 -1.474146 -0.07229
N  -1.579093 -0.443285 1.056187
N  -2.805164 0.71777 -2.838948
N  -1.336616 2.421216 -2.065635
C  3.994827 -1.622184 0.895352
C  3.430284 0.209227 -0.694642
C  2.786228 -2.40558 0.379322
C  2.233901 -0.614658 -1.172664
C  5.748837 0.064356 0.311714
C  0.461774 -2.173055 -0.443888
C  -0.353337 -2.630966 0.785761
C  6.444534 0.866379 -0.803139
C  -0.712559 -1.456823 1.722677
C  -2.843497 -0.875313 0.528502
C  -1.313099 0.937598 1.350763
C  -3.377996 -0.370865 -0.699856
C  -1.382821 1.966234 0.359716
C  -2.652993 0.624431 -1.497845
C  -1.757809 1.665168 -1.025834
C  -3.571953 -1.888885 1.20999
C  -0.894557 1.294151 2.662477
C  -4.614467 -0.87146 -1.189828
C  -1.042236 3.302047 0.704513
C  -4.78989 -2.385297 0.705433
C  -0.546117 2.620129 2.98659
C  -5.321251 -1.873746 -0.501623
C  -0.61985 3.635515 2.004115
H  3.714934 -0.976644 1.749598
H  4.81374 -2.305332 1.171738
H  3.843483 0.797055 -1.528002
H  3.149804 0.867656 0.148703
H  3.132588 -3.071856 -0.444536
H  2.4030 -3.033169 1.204276
H  1.434408 0.080469 -1.487876
H  2.561988 -1.211535 -2.054485
H  5.409555 0.715501 1.139406
H  6.44628 -0.696777 0.702395
H  -0.15395 -1.463776 -1.02708
H  0.657875 -3.053358 -1.10405
H  -1.264481 -3.149601 0.433331
H  0.21726 -3.372572 1.379146
H  6.469807 0.227254 -1.706903
H  5.920756 1.810971 -1.021415
H  -1.156134 -1.840481 2.66667
H  0.230673 -0.943009 1.9737
H  8.400254 0.515692 -0.429484
H  -3.1830 -2.284923 2.152702
H  -0.858929 0.523192 3.438121
H  -5.000056 -0.464211 -2.130099
H  -1.106412 4.068634 -0.074545
H  -5.327777 -3.161824 1.260461
H  -0.234007 2.862653 4.008496
H  -6.269748 -2.250224 -0.896909
H  -0.358666 4.669269 2.250842
