program: Gaussian 09
title: 000135633
version: EM64L-G09RevD.01
frameworkgroup: C1[X(C13H12N2)]
method: RPBEPBE
basis: SDD
operation: Freq
keyword: #pfreq=noraman
keyword: PBEPBE/SDD
title: #p freq=noraman PBEPBE/SDD
converged: NO NO NO NO
title: Mulliken charges:
elementType: N N C C C C C C C C C C C C C H H H H H H H H H H H H
charge: -0.492701 -0.710856 -0.604398 0.334066 0.349314 0.251971 0.186096 -0.353804 -0.643616 -0.368039 -0.415476 0.568876 -0.500095 -0.279019 -0.220709 0.230263 0.230254 0.290757 0.221839 0.213451 0.226381 0.221282 0.214165 0.223390 0.222567 0.300447 0.303596
chargesum: 0.00000
title: Mulliken charges with hydrogens summed into heavy atoms:
elementType: N N C C C C C C C C C C C C C
charge: -0.201945 -0.106813 -0.143881 0.334066 0.349314 0.251971 0.186096 -0.131965 -0.430165 -0.141658 -0.194194 0.568876 -0.285931 -0.055629 0.001858
polarizability: 2.61807544e+02 1.83880485e+00 1.57063207e+02 -5.49437067e-03 -2.18382534e-03 6.42153813e+01
1716.lowfreq: -6.2703 0.0006 0.0008 0.0010 4.0739 5.4903 7.5226 99.4417 151.2579
frequency: 6.4640 99.4388 151.2555 193.7986 223.1853 270.9451 299.7979 314.8344 316.8525 353.4285 356.3712 434.9179 437.1504 447.9676 488.0489 498.9890 541.7097 572.8998 601.2466 626.1617 658.5513 702.6797 716.6718 728.7942 753.6060 780.2521 790.5011 799.5466 838.6478 847.6236 873.8912 917.7974 932.4597 962.8748 966.0643 978.7170 1035.6578 1040.6673 1104.3645 1135.9726 1170.6407 1180.9918 1201.1883 1207.7090 1215.9018 1225.9695 1274.9406 1288.5068 1317.6587 1344.3919 1378.5452 1394.0479 1418.9306 1445.3190 1457.5909 1499.5867 1509.8535 1536.7964 1591.9848 1609.5334 1620.4601 1635.3346 1644.5469 2941.0902 2974.5580 3101.3021 3107.7335 3110.9648 3113.8416 3136.3559 3138.6423 3159.9933 3563.8884 3572.1661 3715.0403
redmass: 3.9452 3.6877 2.9716 4.3392 3.7464 3.6581 1.5373 2.5770 4.3217 1.0371 5.5452 3.4597 2.8595 2.6381 1.1421 5.8451 3.5165 6.4610 6.7213 3.8093 6.1079 2.1510 2.6026 5.4819 1.4611 4.9985 1.4171 4.0426 2.0974 1.3874 5.4707 1.4352 1.3587 2.7927 1.3250 1.8293 1.9564 1.7017 1.8076 1.4943 1.0583 3.6347 1.0849 1.9397 1.5881 1.3518 2.2223 1.5030 2.1917 2.6248 3.3039 7.9758 2.5543 2.6236 1.1741 2.8116 3.4508 3.0053 5.4383 6.7535 5.8122 1.3039 4.0501 1.0589 1.1007 1.0907 1.0873 1.0871 1.0889 1.0919 1.0963 1.1002 1.0765 1.0445 1.1043
irintensity: 0.0012 1.9892 9.1073 0.8060 0.0097 3.8417 149.7199 160.3109 0.8076 1.3196 0.0119 6.0874 8.9481 4.3241 81.1335 0.0381 0.0793 0.9847 4.5950 12.0732 1.6064 21.9525 1.6760 0.0732 89.4443 1.8294 16.7559 2.3116 78.4305 4.8135 3.7423 0.0343 1.0813 9.7185 0.6339 5.0274 5.0852 2.8194 13.7289 26.1480 1.8453 9.5410 0.0016 1.8242 54.7800 3.7088 35.6517 0.7128 101.6672 11.4553 74.2470 27.6653 0.9108 19.0453 4.4427 277.6019 358.5725 13.3979 140.5369 22.4739 101.4411 27.6196 391.4415 44.3196 20.9955 22.1743 19.5479 13.5741 4.5379 26.7908 28.0398 34.8117 15.5139 70.4254 19.0358
temp: 298.150 k
press: 1.00000 atm
elementType: 7 7 6 6 6 6 6 6 6 6 6 6 6 6 6 1 1 1 1 1 1 1 1 1 1 1 1
symmnumber: 1
zpe: 571855.7 jmol-1
zpe.correction: 0.217808 hartree
zpe.thermalcorrener: 0.229906 hartree
zpe.thermalcorrenthalpy: 0.230850 hartree
zpe.thermalcorrgfe: 0.178391 hartree
zpe.sumelectzpe: -611.071800 hartree
zpe.sumelectthermal: -611.059702 hartree
zpe.sumelectthermalent: -611.058758 hartree
zpe.sumelectthermalfe: -611.111217 hartree
dipole: -2.2603 -1.6287 0.0072
dipole: 2.7860
quadrupole: -69.3754 -71.8491 -96.3099
quadrupole: 4.3657 -0.0421 -0.0101
quadrupole: 9.8028 7.3290 -17.1317 4.3657 -0.0421 -0.0101
hfenergy: -611.2896079 hartree
pointgroup: C01 [X(C13H12N2)]
dipole: 0.8796892 -0.6539004 -0.0028213 debye
polarizability: 261.7299908|-3.3909323|157.1407602|-0.0054614|0.0022651|64.2153813 unknown
InChI: InChI=1S/C13H12N2/c14-11-6-5-10-7-9-3-1-2-4-12(9)15-13(10)8-11/h1-6,8,15H,7,14H2
charge 0 multiplicity 1
27 atoms
N  -0.228317 -1.254834 -0.000487
N  4.655708 -1.079906 0.000541
C  -0.457976 1.657354 -0.000492
C  0.884506 0.926381 -0.000273
C  -1.671774 0.728049 -0.00016
C  0.957008 -0.495921 -0.00031
C  -1.515106 -0.688804 -0.000276
C  2.101113 1.641079 -0.000106
C  2.208593 -1.161053 -0.000218
C  -2.980412 1.258017 0.000185
C  -2.657967 -1.533063 -0.000163
C  3.420088 -0.421001 0.000014
C  3.357837 1.001819 0.000015
C  -4.123967 0.425733 0.000354
C  -3.954134 -0.978579 0.000149
H  -0.515493 2.326172 -0.884583
H  -0.515438 2.32683 0.883095
H  -0.151396 -2.271593 -0.00006
H  2.065177 2.738132 -0.000083
H  2.240813 -2.259167 -0.000208
H  -3.105364 2.348586 0.000327
H  -2.527814 -2.623231 -0.000318
H  4.280886 1.593415 0.000198
H  -5.127878 0.86359 0.000636
H  -4.827163 -1.641031 0.000238
H  4.706752 -2.093559 -0.001619
H  5.520916 -0.549412 -0.001495
