program: Gaussian 09
title: 000135618
version: EM64L-G09RevD.01
frameworkgroup: C1[X(C11H9N3)]
method: RPBEPBE
basis: SDD
operation: Freq
keyword: #pfreq=noraman
keyword: PBEPBE/SDD
title: #p freq=noraman PBEPBE/SDD
converged: NO YES NO YES
title: Mulliken charges:
elementType: N N N C C C C C C C C C C C H H H H H H H H H
charge: -0.487649 -0.075347 -0.640896 0.181868 0.185816 0.311986 0.217806 -0.398508 -0.465872 -0.368114 -0.494952 0.186548 -0.249771 -0.218809 0.303046 0.234394 0.225816 0.231414 0.245577 0.222386 0.222437 0.325410 0.305412
chargesum: 0.00000
title: Mulliken charges with hydrogens summed into heavy atoms:
elementType: N N N C C C C C C C C C C C
charge: -0.184602 -0.075347 -0.010074 0.181868 0.185816 0.311986 0.217806 -0.164114 -0.240056 -0.136699 -0.249374 0.186548 -0.027385 0.003628
polarizability: 2.58077899e+02 2.16855209e+00 1.36855485e+02 -3.79622302e-04 1.16313903e-03 5.51275963e+01
1716.lowfreq: -0.0006 -0.0002 0.0004 5.8943 6.0860 14.2156 82.1451 141.3894 188.5620
frequency: 82.1262 141.3884 188.5609 199.7474 300.0569 321.7648 340.1564 351.9165 406.2337 427.1494 449.5727 494.3257 509.0920 515.3074 550.7901 572.2804 585.5917 662.8223 673.5967 728.1089 740.7194 753.0852 774.5950 797.1206 826.7765 853.3458 855.3981 913.8428 925.1112 931.8707 971.7463 988.1910 1019.1202 1022.1206 1109.1834 1166.8685 1193.0678 1206.0520 1242.1797 1250.5982 1311.3108 1328.9712 1347.1521 1355.1334 1413.4880 1438.0009 1460.6773 1480.1131 1504.0776 1559.2376 1593.2516 1607.3891 1626.9696 1642.7039 3125.2829 3126.2663 3134.6764 3140.9190 3147.5505 3164.8070 3557.2086 3610.0261 3714.0976
redmass: 4.9939 4.2457 4.6310 4.4010 5.2999 1.2271 3.7203 4.6342 4.9948 2.0785 3.1689 1.1897 1.1300 4.2022 6.9779 3.7536 6.6793 6.7995 7.9407 5.4985 2.0048 1.9519 2.7177 5.7843 1.8996 5.6812 1.4617 3.4634 1.4590 1.4099 1.3082 5.6651 2.0001 1.4897 1.7305 1.1063 1.8152 2.1966 2.0425 2.6187 1.4416 2.2439 3.1109 3.3263 3.1864 3.8460 3.4624 3.4546 3.9536 6.4173 5.8483 1.3474 6.2045 7.7560 1.0897 1.0871 1.0893 1.0928 1.0951 1.1003 1.0445 1.0801 1.1048
irintensity: 3.8079 0.8060 1.1041 0.0887 0.4975 193.6967 4.3381 17.3500 0.7345 50.4285 18.3108 20.5124 142.4917 4.7155 1.7470 0.3716 6.5972 1.6600 4.8929 0.2813 51.0253 49.5645 7.0723 0.0848 59.3185 1.2209 0.2051 6.9510 8.8156 2.3165 0.0021 0.8826 8.7510 3.4777 3.6879 3.4764 49.0372 6.3633 96.0386 28.1911 7.9149 58.6460 89.0730 3.3098 8.2105 27.2076 69.1622 0.7997 73.9168 34.2442 0.3148 152.1086 228.0041 422.4208 9.5036 9.5067 2.9869 16.0034 32.7961 32.6892 127.8499 41.8164 31.7429
temp: 298.150 k
press: 1.00000 atm
elementType: 7 7 7 6 6 6 6 6 6 6 6 6 6 6 1 1 1 1 1 1 1 1 1
symmnumber: 1
zpe: 469120.9 jmol-1
zpe.correction: 0.178679 hartree
zpe.thermalcorrener: 0.189061 hartree
zpe.thermalcorrenthalpy: 0.190005 hartree
zpe.thermalcorrgfe: 0.143164 hartree
zpe.sumelectzpe: -587.902441 hartree
zpe.sumelectthermal: -587.892059 hartree
zpe.sumelectthermalent: -587.891114 hartree
zpe.sumelectthermalfe: -587.937956 hartree
dipole: -0.7788 -3.6118 0.0024
dipole: 3.6948
quadrupole: -65.0426 -67.7380 -88.1615
quadrupole: 7.4397 -0.0055 -0.0013
quadrupole: 8.6048 5.9094 -14.5142 7.4397 -0.0055 -0.0013
hfenergy: -588.0811198 hartree
pointgroup: C01 [X(C11H9N3)]
dipole: 0.295069 1.4233376 -0.0123866 debye
dipolederiv: -1.110728 -0.0275477 0.0085025 0.0866013 -0.4228534 -0.0000228 0.0078231 0.0013843 -0.3272716 -1.1492093 0.076522 0.0086663 -0.6269593 -0.4257182 0.0078049 0.0140377 0.000167 -0.2725187 -1.9737838 -0.1055837 0.0141136 -0.2671893 -0.1250099 -0.0019164 0.0160985 -0.0035302 -0.7407754 0.4628629 0.0835335 -0.0054763 -0.368367 -0.149241 0.0049867 -0.0022606 0.0001683 0.0000748 -0.3653242 -0.0357216 0.0039934 0.3708838 -0.420589 -0.0010316 0.0013238 0.0032084 -0.0176571 1.0375165 -0.1162385 -0.009153 -0.5491268 0.4094386 0.003595 -0.0062234 -0.0009675 0.1059937 0.4152452 0.3198399 -0.0060929 0.8021735 0.2037939 -0.0096469 -0.0096297 -0.0045601 0.0564688 0.0692771 -0.0223487 -0.0022443 0.0220609 0.1104932 -0.0022138 -0.0026476 -0.0018295 -0.1575948 -0.8703292 -0.0087467 0.006463 0.4433876 -0.0572952 -0.0063655 0.0028519 -0.0015775 -0.2730694 0.0297212 -0.152241 -0.0014494 -0.0342301 0.0456107 -0.0014412 -0.0022739 -0.000162 -0.208589 0.8737139 -0.1752397 -0.008629 -0.1077954 0.3729802 -0.00191 -0.0092916 -0.0008471 -0.0609416 2.1674316 0.1544086 -0.0226111 0.3424264 0.281541 -0.0044452 -0.0241199 -0.00248 0.1585418 -0.1515374 0.072866 -0.0009075 0.1928832 -0.0255091 -0.003195 -0.0017621 -0.0018933 -0.1861751 -0.0967445 0.0220143 -0.001012 -0.1826317 0.0696243 0.0002104 0.0004429 -0.0019549 -0.1754941 0.1146388 -0.0031705 0.0024466 -0.0150152 0.183059 0.001215 0.0025798 0.000914 0.3405935 0.0751416 0.0717299 0.0003232 0.0207815 -0.0846444 0.0015177 0.0007185 0.001051 0.1549702 0.0294998 -0.044965 0.0021463 -0.0887154 -0.1063902 0.0031864 0.0024613 0.0027435 0.2000842 0.0693598 0.0205161 0.0010123 0.0739193 -0.1129956 0.0012733 0.0006533 0.0018529 0.1784454 0.0665635 -0.07532 0.0010934 -0.057166 -0.0794794 0.0019909 0.0008717 0.0020337 0.119091 -0.0585867 -0.1077605 0.0031713 -0.1269178 -0.0210771 0.0026926 0.0033291 0.0024898 0.1665117 -0.1419927 0.0549772 0.0028637 0.0560627 0.0743269 0.0000349 0.0028675 0.0000229 0.16324 0.2733238 -0.0217047 0.0013067 -0.0592754 0.1670263 0.0023694 0.0011475 0.0019677 0.3845892 0.2339402 0.0201807 0.0014732 0.0722091 0.1129084 0.0013114 0.001002 0.0017985 0.3914825 unknown
polarizability: 258.0127786|3.1171734|136.892996|-2.1793681|-0.6191934|55.1552048 unknown
InChI: InChI=1S/C11H9N3/c12-11-5-10-8(6-13-11)7-3-1-2-4-9(7)14-10/h1-6,14H,12H2
charge 0 multiplicity 1
23 atoms
N  -0.30395 1.676169 -0.027329
N  2.694914 -1.25324 -0.03832
N  4.47115 0.255216 -0.068132
C  -1.085758 -0.498622 -0.003558
C  0.372905 -0.522562 -0.01861
C  0.822094 0.847059 -0.033511
C  -1.475438 0.886151 -0.009194
C  -2.089008 -1.495015 0.014137
C  2.189437 1.169846 -0.050359
C  -2.824762 1.287631 0.002296
C  1.363573 -1.527415 -0.021897
C  3.095723 0.069582 -0.051955
C  -3.446334 -1.102341 0.025842
C  -3.809021 0.271862 0.019936
H  -0.286332 2.693282 -0.034138
H  -1.821446 -2.557306 0.019093
H  2.552053 2.202637 -0.061827
H  -3.110931 2.345194 -0.002133
H  1.098658 -2.591159 -0.011945
H  -4.232105 -1.865392 0.039718
H  -4.868545 0.550927 0.029264
H  5.0562 -0.576909 -0.067456
H  4.891524 1.178907 -0.079422
