program: Gaussian 09
title: 000135655
version: EM64L-G09RevD.01
frameworkgroup: C1[X(C20H14N2O2)]
method: RPBEPBE
basis: SDD
operation: Freq
keyword: #p
keyword: freq=noraman
keyword: PBEPBE/SDD
title: #p freq=noraman PBEPBE/SDD
converged: YES YES NO NO
title: Mulliken charges:
elementType: O O N N C C C C C C C C C C C C C C C C C C C C H H H H H H H H H H H H H H
charge: -0.373860 -0.225270 -0.539216 -0.031057 0.216941 0.240088 0.238451 -0.094787 -0.112957 -0.385961 -0.339223 -0.305470 -0.306302 0.569853 -0.258222 -0.260921 -0.232573 -0.236863 -0.331310 -0.429572 -0.323670 -0.224376 0.205705 0.016969 0.310344 0.226117 0.267111 0.268429 0.267930 0.232155 0.234554 0.235930 0.235701 0.256224 0.209556 0.188457 0.237675 0.353421
chargesum: 0.00000
title: Mulliken charges with hydrogens summed into heavy atoms:
elementType: O O N N C C C C C C C C C C C C C C C C C C C C
charge: -0.020439 -0.225270 -0.228872 -0.031057 0.216941 0.240088 0.238451 -0.094787 -0.112957 -0.159845 -0.072112 -0.037041 -0.038372 0.569853 -0.026067 -0.026367 0.003357 -0.001162 -0.075086 -0.220016 -0.135214 0.013299 0.205705 0.016969
polarizability: 4.30729272e+02 -2.23228896e+01 3.00848800e+02 1.71042383e+01 1.26747070e+01 1.49343441e+02
1716.lowfreq: -1.0699 -0.0003 -0.0003 0.0003 3.5331 6.3169 25.7642 30.3191 46.2208
frequency: 25.7610 30.2699 46.2175 73.4787 81.5793 103.0912 121.0173 156.8374 185.2236 239.4046 256.5234 276.0384 303.1728 327.9743 333.6939 356.3749 372.5016 380.0446 390.2037 398.2936 432.8943 446.5877 448.7469 474.6270 499.3568 504.2450 507.3973 554.3855 582.5491 592.4530 607.9635 619.9397 629.5902 645.1052 661.6185 699.3581 738.4031 741.9113 747.4878 761.4052 772.2343 780.6726 803.0511 824.1568 847.9725 853.5024 864.6585 871.7919 876.6899 887.4930 927.6895 938.7455 964.9683 968.5302 996.2244 996.7095 1006.1488 1018.6772 1021.6403 1031.2507 1079.7081 1110.3265 1148.6899 1161.4098 1175.2184 1182.6497 1217.3128 1223.7428 1245.0664 1252.4527 1272.7848 1284.8238 1286.6821 1290.5864 1349.9914 1368.9805 1371.7758 1396.0809 1413.0416 1427.4596 1440.3897 1446.4897 1454.4550 1479.1694 1492.4148 1512.1710 1524.8793 1549.7575 1553.8381 1563.0192 1587.3375 1610.8992 1630.7024 1635.9993 3061.0509 3074.0975 3124.9310 3125.6731 3134.8782 3140.4935 3141.1987 3149.7390 3157.3181 3167.5043 3172.8419 3175.3783 3514.5577 3546.2480
redmass: 7.1422 5.4868 5.5443 5.1719 5.1479 4.4858 4.3732 5.2113 6.0367 4.8134 5.0926 5.4038 5.5240 4.0931 8.5882 7.0358 3.2379 2.9717 4.7057 5.0520 4.3639 4.6922 1.3220 2.8983 1.5559 2.8853 5.6719 5.4596 4.2240 5.1258 4.0709 4.1609 5.7003 6.1492 5.5135 5.1168 6.1627 3.2886 3.4900 2.0851 1.3648 2.8372 2.8528 1.4565 5.5680 2.0009 4.5038 1.5686 2.0575 3.5175 5.0796 1.4244 1.3573 1.3548 1.3279 1.3280 1.3214 2.2929 2.0614 2.9934 4.3267 2.0282 1.3687 1.1890 1.6285 1.1865 1.9397 1.4830 3.1266 2.4442 1.7841 1.8530 2.1703 1.7545 2.0725 2.1439 2.2224 2.9604 1.9807 5.6223 2.6121 2.1221 3.1220 2.8105 2.5236 4.8522 6.5528 7.4533 4.9947 6.5720 4.5716 5.7238 6.4039 6.1330 1.0863 1.0866 1.0859 1.0908 1.0860 1.0890 1.0895 1.0895 1.0948 1.0950 1.0997 1.0996 1.0749 1.0655
irintensity: 3.2831 1.9680 2.5128 5.4770 0.9233 1.1241 1.2559 2.7091 2.5957 2.3089 1.4166 1.5802 4.0289 13.6257 17.3883 5.3287 17.7831 29.9224 6.7508 6.2606 20.9589 8.0442 102.5368 6.9528 147.9201 44.9174 3.6695 10.6585 9.1839 7.5281 17.9610 13.9932 8.3904 6.5070 0.7485 6.1209 35.8956 0.2760 3.3721 113.2484 5.9731 33.3567 8.3538 25.7389 3.3437 46.4148 3.3630 1.4163 5.6403 7.9316 4.7163 0.1246 1.0029 3.0991 0.0772 0.5984 0.2010 4.2018 27.7630 235.5022 18.1781 0.0705 40.8624 6.8060 238.5382 16.5647 52.8653 7.7692 1.0184 5.0594 64.2573 2.9615 40.9713 20.0793 19.0560 42.1061 120.4301 11.9640 6.5979 134.5368 50.0447 97.8252 7.1291 28.1961 282.3531 384.3621 40.7411 33.3999 50.3863 138.9497 17.3068 9.1828 9.0612 21.2627 33.2315 14.1621 1.7768 9.2893 4.4248 13.1750 5.7823 8.6195 19.8628 12.3882 33.3300 20.6900 22.2268 68.9934
temp: 298.150 k
press: 1.00000 atm
elementType: 8 8 7 7 6 6 6 6 6 6 6 6 6 6 6 6 6 6 6 6 6 6 6 6 1 1 1 1 1 1 1 1 1 1 1 1 1 1
symmnumber: 1
zpe: 753843.2 jmol-1
zpe.correction: 0.287124 hartree
zpe.thermalcorrener: 0.305890 hartree
zpe.thermalcorrenthalpy: 0.306835 hartree
zpe.thermalcorrgfe: 0.239259 hartree
zpe.sumelectzpe: -1028.824071 hartree
zpe.sumelectthermal: -1028.805304 hartree
zpe.sumelectthermalent: -1028.804360 hartree
zpe.sumelectthermalfe: -1028.871936 hartree
dipole: 4.8386 -0.0336 0.3976
dipole: 4.8550
quadrupole: -189.9964 -118.1707 -129.9732
quadrupole: -15.8614 -4.4798 7.0634
quadrupole: -43.9497 27.8761 16.0736 -15.8614 -4.4798 7.0634
hfenergy: -1029.1111948 hartree
pointgroup: C01 [X(C20H14N2O2)]
dipole: 1.8008996 -0.6250727 0.1207439 debye
polarizability: 403.2739001|-62.1223716|314.4513944|21.0910994|41.7949043|163.1962186 unknown
InChI: InChI=1S/C20H14N2O2/c23-18-11-9-13(10-12-19(18)24)21-20-14-5-1-3-7-16(14)22-17-8-4-2-6-15(17)20/h1-12,21,23H
charge 0 multiplicity 1
38 atoms
O  -5.043483 1.777463 1.906984
O  -6.021981 1.194651 -0.484247
N  -0.347501 -0.448355 -1.117811
N  3.617414 -0.298696 0.564727
C  0.939806 -0.374106 -0.52512
C  1.702971 -1.578642 -0.385643
C  1.527979 0.874146 -0.139642
C  3.059393 -1.477218 0.144453
C  2.870892 0.844221 0.435191
C  1.192147 -2.881467 -0.721862
C  0.894685 2.150658 -0.337754
C  3.854925 -2.671584 0.255236
C  3.476023 2.081082 0.856913
C  -1.579362 0.039206 -0.610253
C  1.990197 -4.016616 -0.595676
C  1.521728 3.327759 0.062468
C  3.339812 -3.909704 -0.115033
C  2.817586 3.293652 0.683118
C  -1.676643 0.483792 0.71579
C  -2.67227 -0.000913 -1.554986
C  -2.80654 1.013929 1.399023
C  -3.996884 0.366038 -1.410291
C  -4.131525 1.229897 1.002963
C  -4.779533 0.943527 -0.304173
H  -0.426846 -1.086217 -1.913528
H  0.152004 -2.992184 -1.049079
H  -0.086281 2.195372 -0.818176
H  4.870951 -2.556639 0.644628
H  4.474831 2.017968 1.299148
H  1.583864 -5.001762 -0.849019
H  1.028097 4.291331 -0.104039
H  3.954351 -4.812065 -0.026719
H  3.289813 4.229368 1.001319
H  -0.765443 0.414518 1.32015
H  -2.402177 -0.380747 -2.552799
H  -2.587846 1.294422 2.443114
H  -4.636894 0.228327 -2.293051
H  -4.612062 1.968886 2.779576
