program: Gaussian 09
title: 000135629
version: EM64L-G09RevD.01
frameworkgroup: C1[X(C13H6Cl2N2O2)]
method: RPBEPBE
basis: SDD
operation: Freq
keyword: #p
keyword: freq=noraman
keyword: PBEPBE/SDD
title: #p freq=noraman PBEPBE/SDD
converged: NO NO NO NO
title: Mulliken charges:
elementType: Cl Cl O O N N C C C C C C C C C C C C C H H H H H H
charge: 0.012955 0.021266 -0.158985 -0.158997 0.014552 -0.030638 0.387600 0.014782 0.456384 -0.359424 -0.106355 0.312515 -0.283512 -0.346899 -0.328057 -0.290830 -0.250713 -0.234008 -0.226566 0.264754 0.259280 0.277686 0.271330 0.239407 0.242472
chargesum: 0.00000
title: Mulliken charges with hydrogens summed into heavy atoms:
elementType: Cl Cl O O N N C C C C C C C C C C C C C
charge: 0.012955 0.021266 -0.158985 -0.158997 0.014552 -0.030638 0.387600 0.014782 0.456384 -0.359424 -0.106355 0.312515 -0.283512 -0.087618 -0.063304 -0.013144 0.020617 0.005399 0.015906
polarizability: 2.88611178e+02 -9.34489452e+00 2.31215396e+02 3.62118216e-02 -1.23497350e-02 8.21406685e+01
1716.lowfreq: -44.5205 -0.3304 -0.0022 -0.0013 -0.0007 3.4241 7.5459 57.8017 78.4294
frequency: -44.5205 57.8006 78.4211 82.9966 123.0611 138.2831 164.6381 203.9028 225.3222 252.1593 252.6758 286.4779 299.7266 375.5252 396.9942 398.0326 436.4865 450.1184 497.1292 529.1804 548.6110 567.7779 603.4243 616.4460 643.9498 647.0718 691.2467 708.3304 751.0403 760.6707 777.3966 797.3663 816.0772 835.4447 884.1891 911.5168 935.3665 948.5317 951.5701 977.8429 1002.8152 1018.6175 1121.0851 1126.0701 1162.3031 1179.1982 1230.7547 1240.4886 1258.0593 1280.1647 1300.9471 1313.8664 1368.3029 1382.5078 1390.0221 1405.6898 1451.8249 1463.7771 1532.1400 1542.5096 1548.3414 1596.3916 1625.9278 3142.9059 3157.0859 3164.3774 3173.8644 3181.3153 3185.1632
redmass: 12.6938 9.8724 14.2065 4.9535 5.9962 10.8422 14.5433 8.4186 19.3752 10.0987 5.7033 17.3758 6.4963 8.2340 8.2419 4.8325 7.2258 4.0186 3.9968 10.0843 4.1992 8.9140 4.9190 7.1189 8.4325 6.5182 8.3003 10.9628 5.2066 11.0665 1.3656 4.7578 7.2073 1.3502 1.6391 6.8229 1.3805 8.4660 8.2183 1.3448 1.3344 2.1687 2.0223 1.8595 1.5121 1.4772 2.8366 2.4287 5.2878 2.3627 4.3506 5.0334 2.1456 14.6382 3.6697 5.7409 3.1926 3.1590 7.7836 7.7530 8.3109 7.1196 6.6019 1.0866 1.0898 1.0902 1.0953 1.0999 1.0965
irintensity: 0.4458 0.5053 0.9932 2.6577 1.0547 2.5053 3.2996 0.2067 0.5800 0.4012 0.7506 1.1392 0.0604 1.8466 5.2358 0.3149 0.8165 1.7663 1.2432 18.6882 7.4161 0.1685 0.7230 11.3515 15.3011 12.8088 3.4281 20.6106 1.5963 57.3808 91.4835 1.6287 3.2183 38.2070 0.2765 9.9829 0.0003 8.9755 17.9923 1.6888 0.0743 6.7535 24.2317 1.3242 14.4521 33.1792 39.5545 10.9133 43.5723 21.0288 43.4230 30.1972 5.4839 167.4297 14.0824 52.7517 13.5551 30.0799 29.2937 1.3083 12.1131 9.3656 8.8641 5.3543 7.3024 1.5488 3.9926 21.4964 0.1672
temp: 298.150 k
press: 1.00000 atm
elementType: 17 17 8 8 7 7 6 6 6 6 6 6 6 6 6 6 6 6 6 1 1 1 1 1 1
symmnumber: 1
zpe: 419705.7 jmol-1
zpe.correction: 0.159857 hartree
zpe.thermalcorrener: 0.174100 hartree
zpe.thermalcorrenthalpy: 0.175044 hartree
zpe.thermalcorrgfe: 0.118068 hartree
zpe.sumelectzpe: -1677.667492 hartree
zpe.sumelectthermal: -1677.653250 hartree
zpe.sumelectthermalent: -1677.652306 hartree
zpe.sumelectthermalfe: -1677.709282 hartree
dipole: 2.8409 1.3087 -0.0001
dipole: 3.1278
quadrupole: -99.3221 -129.9485 -128.3951
quadrupole: -16.0676 0.0033 0.0012
quadrupole: 19.8998 -10.7266 -9.1732 -16.0676 0.0033 0.0012
hfenergy: -1677.8273496 hartree
pointgroup: C01 [X(C13H6Cl2N2O2)]
dipole: -1.1343727 0.4770011 0.0000532 debye
dipolederiv: -0.1042826 0.1173862 -0.000047 0.1207838 -0.6962353 0.0001326 -0.0000391 0.0001307 -0.0098195 -0.0572093 0.2000647 0.0000223 0.0387288 -0.7979353 -0.0000872 -0.000007 -0.000049 -0.0214693 -0.3504837 0.189417 -0.1132839 0.2616463 -0.4744302 0.1646685 -0.0318538 0.0179623 -0.673522 -0.3500842 0.1890762 0.1127206 0.2616195 -0.4747047 -0.1648251 0.0314064 -0.0181148 -0.6736519 -0.5082339 -0.0019334 -0.0000327 -0.0060063 -0.3250239 0.0000111 -0.0000624 0.0000284 -0.2163021 0.3928548 -0.3973127 0.0006362 -0.5613971 0.7846909 0.0001531 0.0006831 -0.0000481 1.25401 0.0127046 0.0005381 -0.0000424 0.0051798 -0.5400124 0.0000266 0.0000527 -0.0003189 0.0850753 0.2952872 -0.0508731 0.0000468 0.0407497 -0.0964857 -0.0000475 0.0000781 -0.0000601 0.1161449 -0.1598476 0.2014339 -0.0000441 0.3988964 -0.3483731 0.0000876 0.0000255 0.0000731 0.075855 0.3534047 -0.2281401 0.0001146 -0.1969194 1.1726599 -0.0002483 0.000066 -0.0001837 -0.062235 0.4646059 0.1622281 0.0000509 -0.2220067 0.1449495 -0.0000466 0.0000764 0.0000192 0.0890958 0.2071553 -0.0226 -0.0000838 -0.1122957 0.090455 0.0000426 -0.0002132 0.0002393 -0.078791 0.054427 -0.3427201 -0.0000133 -0.006708 1.2638286 0.000144 0.0000303 0.0000966 -0.1003356 -0.1308968 -0.081278 0. 0.0630491 0.0428506 0.0000302 -0.0000192 0.0000209 -0.1408618 -0.0349195 -0.0916002 -0.0000214 -0.0100359 0.0752001 -0.0000199 -0.0002343 0.0002936 -0.0980948 -0.1694887 -0.1007105 -0.0000034 -0.1200292 0.0556599 0.0000086 -0.000031 -0.0000153 -0.1544923 -0.1185411 0.2356586 0.0000131 0.0721326 -0.1673486 0.0000168 0.0000552 0.0000037 -0.0866671 -0.0262138 0.1623101 0.0000316 0.1356721 0.1255032 0.0000415 0.0000479 0.0000459 -0.1310173 0.1373867 -0.1354144 0.0000296 -0.1481207 0.0228325 -0.0000141 0.0000205 -0.0000155 -0.1322548 -0.0032966 0.0347952 0.0000092 0.0450893 0.0717357 0.0000004 0.0000012 -0.0000212 0.1531452 0.0884392 0.0623267 -0.0000043 -0.0229504 -0.0107199 -0.0000175 -0.0000122 -0.0000007 0.1607807 0.0883657 -0.0093179 -0.0000136 0.0593465 -0.0164975 -0.000004 -0.0000079 -0.0000154 0.1617821 0.053606 -0.0541351 -0.0000132 -0.0462126 0.0180031 -0.0000268 0.0000103 -0.0000475 0.1670344 -0.0293949 -0.0947863 -0.000038 -0.1041085 0.00114 -0.0000287 -0.0000436 -0.0000282 0.1572829 -0.1053444 0.0555871 -0.0000339 0.0538969 0.0782579 0.0000021 -0.0000298 0.0000047 0.1593084 unknown
polarizability: 287.9182625|11.252438|231.9083122|0.0357761|0.0135603|82.1406685 unknown
InChI: InChI=1S/C13H6Cl2N2O2/c14-8-5-6-10(17(18)19)11-12(15)7-3-1-2-4-9(7)16-13(8)11/h1-6H
charge 0 multiplicity 1
25 atoms
Cl 0.103027 -2.876243 0.000392
Cl 0.702515 4.051768 0.000582
O  3.077533 -2.198602 1.143067
O  3.075919 -2.198695 -1.143751
N  -1.046529 1.641186 0.000114
N  2.789119 -1.682378 -0.000152
C  0.728554 -0.120522 0.000166
C  0.263853 1.283375 0.000232
C  -1.67857 -0.758623 -0.00014
C  -0.301199 -1.105566 0.000061
C  -2.00158 0.666559 -0.0001
C  2.155174 -0.329508 0.000206
C  1.256709 2.338162 0.000459
C  -2.757548 -1.708932 -0.000361
C  3.065972 0.719291 0.000416
C  -3.380211 1.074101 -0.000275
C  2.617715 2.072884 0.00055
C  -4.080008 -1.275855 -0.000539
C  -4.397211 0.126046 -0.000492
H  4.13899 0.506367 0.000433
H  -2.527145 -2.777495 -0.000407
H  -3.582087 2.148941 -0.000224
H  3.344233 2.888979 0.000711
H  -4.891863 -2.010571 -0.000733
H  -5.445461 0.442331 -0.000615
