program: Gaussian 09
title: 000135657
version: EM64L-G09RevD.01
frameworkgroup: C1[X(C19H21N3O)]
method: RPBEPBE
basis: SDD
operation: Freq
keyword: #p
keyword: freq=noraman
keyword: PBEPBE/SDD
title: #p freq=noraman PBEPBE/SDD
converged: YES YES NO NO
title: Mulliken charges:
elementType: O N N N C C C C C C C C C C C C C C C C C C C H H H H H H H H H H H H H H H H H H H H H
charge: -0.304296 -0.371678 -0.153995 -0.086057 0.298117 -0.092799 0.179837 0.347363 -0.442624 0.408151 -0.396358 -0.334569 -0.050033 -0.390398 -0.454618 0.120975 -0.834730 -0.398317 -0.327423 -0.618691 -0.617780 -0.252686 -0.218549 0.262247 0.252450 0.206257 0.175836 0.255691 0.286985 0.237946 0.372440 0.235087 0.242725 0.234942 0.238672 0.255274 0.236071 0.184144 0.217520 0.184977 0.219028 0.223936 0.234021 0.234909
chargesum: 0.00000
title: Mulliken charges with hydrogens summed into heavy atoms:
elementType: O N N N C C C C C C C C C C C C C C C C C C C
charge: -0.304296 0.000762 -0.153995 -0.086057 0.298117 -0.092799 0.179837 0.347363 -0.180377 0.408151 0.062350 0.096959 -0.050033 -0.103413 -0.216672 0.120975 -0.121976 -0.159646 -0.072150 0.019044 0.010161 -0.018664 0.016359
polarizability: 3.08811154e+02 -1.35311068e+01 3.36985629e+02 -1.65469926e+01 -4.48947616e+00 1.18781134e+02
1716.lowfreq: -7.1841 -1.3703 0.0005 0.0007 0.0008 2.7793 19.5711 29.0746 31.7866
frequency: 19.4959 28.8645 31.7634 66.4666 74.8253 91.1172 99.2644 108.8260 119.8077 180.2408 182.5371 200.5980 212.6229 223.6070 235.3878 249.8402 265.0852 273.6424 323.7157 333.5529 350.8899 357.8604 386.8375 403.2739 419.6632 435.5576 473.1452 477.3957 500.2037 523.6097 552.5361 567.1426 597.1370 600.7099 613.1265 662.1810 707.6427 720.2966 744.0040 759.9554 772.8690 789.4226 810.7897 812.7330 835.3786 867.0786 873.8595 901.7038 902.7718 929.3488 951.4174 967.2715 970.5728 995.1283 999.2943 1011.1626 1015.1712 1029.7570 1034.9325 1047.1625 1056.7698 1071.3647 1077.2394 1091.2359 1130.4230 1138.2232 1144.9057 1168.9429 1194.1463 1210.7634 1215.9869 1250.7865 1262.4307 1264.0280 1273.7571 1278.5392 1300.3972 1307.0759 1325.9508 1336.7008 1361.4040 1370.4805 1384.3703 1398.1009 1406.4025 1418.5319 1428.6872 1439.1663 1450.1439 1458.3060 1461.4116 1467.1174 1471.3220 1471.9882 1474.9946 1479.9225 1480.5552 1485.2603 1531.6267 1550.2071 1560.5426 1583.9589 1587.8722 1614.2939 1632.6052 2837.3418 2843.5893 2861.7321 2973.1528 3011.4521 3016.0898 3022.2547 3047.2437 3051.5262 3076.3982 3081.0393 3084.0462 3091.4531 3124.4771 3133.1274 3137.9874 3140.3716 3153.6726 3154.1235 3157.0113 3169.3924
redmass: 3.7758 3.7546 3.1289 5.7867 4.2085 2.5249 4.8277 4.2473 3.2985 1.9091 1.2408 3.3623 1.1107 2.4083 1.8485 4.0067 3.7343 3.0560 3.9308 5.4195 5.0190 2.9201 3.2117 3.6365 2.8687 3.8078 2.8845 3.8615 3.5618 5.9653 5.1295 4.4429 5.0636 3.7740 6.9228 5.9136 6.8064 5.4642 2.0155 1.5783 2.5808 4.7948 3.7617 2.8441 2.5150 1.4261 1.3959 1.1186 5.4795 1.5893 2.6760 3.3151 1.3894 1.3356 1.3865 2.2670 3.3176 2.6826 1.5727 1.5665 2.4269 2.3732 1.6687 1.3700 1.6829 1.5091 1.8289 1.1182 1.9537 1.9246 1.6727 3.2003 2.0427 1.8915 1.8252 2.1552 1.7885 1.6693 1.3332 4.5678 2.4464 1.3259 2.0148 1.4670 3.3306 1.1401 7.9441 1.1445 1.1291 3.3646 1.0557 1.0575 1.3900 1.4674 1.0519 1.0891 1.2718 1.0589 5.5253 2.0503 6.1106 5.4863 4.9846 6.4526 6.1948 1.0582 1.0642 1.0634 1.0383 1.0599 1.0722 1.0705 1.0972 1.0886 1.1012 1.1001 1.1039 1.0976 1.0874 1.0890 1.0885 1.0909 1.0941 1.0907 1.0906 1.1004
irintensity: 0.6155 1.9588 0.1375 2.0044 0.6787 0.6183 2.4186 1.7218 4.0663 0.8489 0.5996 4.5816 2.9616 0.4582 0.5545 0.3046 1.3471 7.6247 2.3006 0.4286 11.9870 16.2553 7.1177 0.2332 4.3182 0.7593 10.5751 11.8139 1.0578 8.5276 6.1338 0.2230 0.7528 0.3471 4.0302 9.6401 1.1269 24.5817 0.4814 49.4725 9.6238 2.8670 9.8778 5.9935 4.7009 2.4260 14.4100 94.7090 1.3790 22.5155 9.0493 5.9755 10.2888 0.1145 1.8990 7.6131 16.2506 7.9407 22.5861 4.9764 30.0607 27.1540 13.2238 11.1926 9.7206 4.4693 3.4565 1.7010 10.8159 1.7360 5.8205 31.5033 20.3940 0.8697 2.3100 10.7826 17.6287 4.3647 0.5957 13.9382 12.7518 0.3754 8.0107 11.1600 9.4203 3.8865 9.6758 4.3551 10.7524 35.5452 13.7369 7.9265 19.3278 18.3290 26.6447 14.5271 3.5636 10.1368 79.3798 279.6070 103.5567 8.7325 34.6445 118.1999 15.3188 70.2170 83.8138 217.5280 32.1306 31.8034 45.1504 71.6606 17.8085 2.9082 9.8206 62.2410 37.7551 18.0216 4.6107 17.0713 2.3661 11.7191 32.3915 392.0765 174.5769 29.0671
temp: 298.150 k
press: 1.00000 atm
elementType: 8 7 7 7 6 6 6 6 6 6 6 6 6 6 6 6 6 6 6 6 6 6 6 1 1 1 1 1 1 1 1 1 1 1 1 1 1 1 1 1 1 1 1 1
symmnumber: 1
zpe: 944623.3 jmol-1
zpe.correction: 0.359788 hartree
zpe.thermalcorrener: 0.380971 hartree
zpe.thermalcorrenthalpy: 0.381915 hartree
zpe.thermalcorrgfe: 0.308323 hartree
zpe.sumelectzpe: -974.469223 hartree
zpe.sumelectthermal: -974.448040 hartree
zpe.sumelectthermalent: -974.447095 hartree
zpe.sumelectthermalfe: -974.520687 hartree
dipole: -5.7047 3.3845 1.6616
dipole: 6.8381
quadrupole: -116.3604 -123.6433 -141.7547
quadrupole: 12.2226 2.6607 -4.1557
quadrupole: 10.8924 3.6095 -14.5019 12.2226 2.6607 -4.1557
hfenergy: -974.8290107 hartree
pointgroup: C01 [X(C19H21N3O1)]
dipole: -2.3868343 0.5706391 1.102315 debye
polarizability: 310.5970122|-7.1490419|313.5316898|-36.2223792|58.1453065|140.4492141 unknown
InChI: InChI=1S/C19H21N3O/c1-13-8-9-15(19(23)20-10-11-22(2)3)18-16(13)12-14-6-4-5-7-17(14)21-18/h4-9,12,20H,10-11H2,1-3H3
charge 0 multiplicity 1
44 atoms
O  2.927476 -1.959056 -1.457865
N  2.119023 0.105433 -0.73181
N  -0.478254 0.238704 -0.024348
N  5.648629 1.24765 0.137654
C  -1.862332 -1.805032 -0.21679
C  -0.586524 -1.091418 -0.348575
C  0.580473 -1.810587 -0.832021
C  -1.956977 -3.210108 -0.565018
C  -2.978223 -1.07409 0.256522
C  -2.870704 0.29654 0.591327
C  3.407145 0.788552 -0.897334
C  4.378986 0.500584 0.277479
C  -1.568992 0.92897 0.431877
C  0.436941 -3.16204 -1.152159
C  -0.807088 -3.852724 -1.023393
C  1.970725 -1.226518 -1.028879
C  -3.268889 -3.959674 -0.435384
C  -3.976334 1.079173 1.075347
C  -1.426229 2.320703 0.763678
C  6.788102 0.582851 0.800066
C  5.536848 2.665951 0.527898
C  -3.805201 2.424447 1.387659
C  -2.518167 3.048355 1.22971
H  -3.947431 -1.572619 0.36805
H  3.890386 0.443865 -1.82799
H  3.211412 1.872462 -0.985943
H  3.862005 0.721289 1.246851
H  4.599508 -0.58114 0.25995
H  1.332826 -3.679364 -1.513291
H  -0.854274 -4.913773 -1.293208
H  1.259497 0.581468 -0.381373
H  -4.06135 -3.512422 -1.065521
H  -3.148182 -5.010189 -0.746745
H  -3.640831 -3.959895 0.607155
H  -4.954928 0.598553 1.193721
H  -0.440986 2.780606 0.637834
H  6.888853 -0.448075 0.418458
H  6.691457 0.533084 1.915348
H  7.722164 1.126406 0.566338
H  5.315056 2.805115 1.618362
H  4.735941 3.162761 -0.046902
H  6.483471 3.189664 0.302594
H  -4.648539 3.018239 1.755814
H  -2.402788 4.108497 1.480655
