program: Gaussian 09
title: 000135596
version: EM64L-G09RevD.01
frameworkgroup: C1[X(C18H10O2)]
method: RPBEPBE
basis: SDD
operation: Freq
keyword: #pfreq=noraman
keyword: PBEPBE/SDD
title: #p freq=noraman PBEPBE/SDD
converged: NO YES NO NO
title: Mulliken charges:
elementType: O O C C C C C C C C C C C C C C C C C C H H H H H H H H H H
charge: -0.146808 -0.153130 0.237821 0.472851 0.292768 0.242978 0.418584 -0.604447 0.407724 -0.701024 -0.486060 -0.417429 -0.286869 -0.132175 -0.424195 -0.417158 -0.340586 0.042535 -0.239808 -0.235457 0.231051 0.253365 0.252147 0.286201 0.225737 0.245721 0.247202 0.258696 0.234911 0.234853
chargesum: 0.00000
title: Mulliken charges with hydrogens summed into heavy atoms:
elementType: O O C C C C C C C C C C C C C C C C C C
charge: -0.146808 -0.153130 0.237821 0.472851 0.292768 0.242978 0.418584 -0.373396 0.407724 -0.447659 -0.233912 -0.131227 -0.061132 -0.132175 -0.178474 -0.169956 -0.081890 0.042535 -0.004897 -0.000604
polarizability: 4.31504611e+02 -6.42445140e+00 2.20404300e+02 1.68903034e-03 -1.48148265e-03 7.33872847e+01
1716.lowfreq: -0.0010 -0.0003 0.0006 6.0352 6.5896 16.4730 49.5383 52.8393 82.2014
frequency: 49.4791 52.8182 82.1935 124.5223 138.3019 192.0328 249.0390 270.7759 286.9627 288.1009 313.1586 343.4129 407.3965 410.5385 424.7363 470.1234 477.5951 495.8584 511.6538 530.1491 557.8939 576.0122 606.5188 617.9280 620.3524 686.6788 697.6763 746.1813 757.5680 776.6434 782.9490 822.7795 829.3921 833.2617 861.7564 866.2063 873.5058 908.9343 911.3026 939.7585 962.3054 973.1405 993.6893 996.0167 1005.2235 1015.0071 1049.2646 1126.6418 1143.8410 1174.4334 1191.2214 1199.3531 1206.3166 1232.0806 1269.1438 1289.7677 1293.4430 1305.7966 1339.0855 1400.1398 1406.8267 1416.7455 1431.5575 1443.6342 1451.7714 1481.2825 1531.0180 1547.9162 1559.1385 1578.3384 1587.7369 1605.4738 1614.8140 1635.1838 3122.7135 3123.4892 3128.8734 3132.8169 3137.2078 3146.4259 3147.7968 3164.7992 3165.0218 3166.4390
redmass: 7.2290 8.7249 4.5183 5.3948 6.4729 4.5114 5.0842 9.3573 4.3408 5.8139 3.7613 14.6433 3.2244 5.7445 8.2512 2.4417 4.1602 7.3409 6.1382 3.3890 6.8396 4.1301 6.2881 3.5199 6.4758 7.1788 6.6154 2.4080 1.3034 5.1016 2.2862 5.1632 1.5075 1.8883 5.6045 1.6798 2.8514 1.6887 5.8902 2.0701 4.2902 1.3987 1.3372 1.3519 1.3902 2.3053 3.5361 1.8752 1.4693 1.0910 1.5417 1.7596 1.6694 1.5945 1.9904 1.9098 2.6382 3.2733 2.1149 2.4246 4.3345 2.3849 5.1455 5.1882 2.6795 2.9291 6.9983 10.2070 6.6506 6.4682 8.1007 7.0779 6.5268 6.5262 1.0897 1.0886 1.0887 1.0892 1.0883 1.0943 1.0884 1.0967 1.0996 1.0970
irintensity: 1.9250 0.4455 0.8357 5.6399 0.3275 0.4978 0.9967 2.1780 0.1680 4.1124 0.0850 4.4772 0.8848 1.5309 1.3578 21.3650 2.1691 1.6946 8.3096 0.0362 0.1122 9.3820 6.0818 0.0563 2.1522 3.6286 1.6369 40.1406 41.3598 0.2416 2.4832 0.9404 2.2354 27.3405 4.1801 0.3036 2.1051 79.0817 2.6831 12.6444 21.7586 11.8779 0.3127 0.1644 0.0593 2.6774 1.4102 8.7565 6.0559 1.7538 10.7837 0.9040 17.0025 23.9965 61.0236 13.0858 56.9625 14.5012 13.2481 1.8595 23.3309 0.7677 78.8791 4.2608 0.6835 43.1577 48.8312 361.4407 0.8314 19.0916 7.6600 41.6481 11.5105 11.0347 1.6436 6.7529 0.9115 9.2894 0.3408 16.8382 14.3248 9.1496 41.0184 15.4687
temp: 298.150 k
press: 1.00000 atm
elementType: 8 8 6 6 6 6 6 6 6 6 6 6 6 6 6 6 6 6 6 6 1 1 1 1 1 1 1 1 1 1
symmnumber: 1
zpe: 581894.0 jmol-1
zpe.correction: 0.221632 hartree
zpe.thermalcorrener: 0.235901 hartree
zpe.thermalcorrenthalpy: 0.236845 hartree
zpe.thermalcorrgfe: 0.180192 hartree
zpe.sumelectzpe: -841.043548 hartree
zpe.sumelectthermal: -841.029279 hartree
zpe.sumelectthermalent: -841.028335 hartree
zpe.sumelectthermalfe: -841.084988 hartree
dipole: 8.5046 -0.9488 -0.0012
dipole: 8.5574
quadrupole: -140.3990 -97.8640 -118.9779
quadrupole: 2.4974 0.0080 -0.0013
quadrupole: -21.3187 21.2163 0.1024 2.4974 0.0080 -0.0013
hfenergy: -841.2651802 hartree
pointgroup: C01 [X(C18H10O2)]
dipole: 3.3466362 -0.3673459 -0.0004603 debye
polarizability: 431.5268268|-6.0484134|220.382084|0.0016917|-0.0014785|73.3872847 unknown
InChI: InChI=1S/C18H10O2/c19-17-8-7-14-15(18(17)20)6-5-13-9-11-3-1-2-4-12(11)10-16(13)14/h1-10H
charge 0 multiplicity 1
30 atoms
O  -4.490084 1.388203 0.000563
O  -5.348564 -1.309385 0.000306
C  0.18857 -0.054461 -0.000124
C  0.617093 1.34698 -0.000057
C  -1.238188 -0.347962 -0.00019
C  -2.169167 0.718369 -0.000253
C  2.571353 -0.747093 0.000035
C  1.189351 -1.059372 -0.000065
C  2.990712 0.650766 0.000087
C  1.996992 1.658563 0.000041
C  -0.377029 2.38913 -0.000086
C  -1.729865 2.084879 -0.000181
C  -1.731809 -1.729218 -0.000068
C  -3.637932 0.454383 -0.000497
C  3.582622 -1.774314 0.000076
C  4.398522 0.954854 0.000183
C  -3.064898 -2.060965 0.000161
C  -4.114031 -1.030816 0.00023
C  4.933791 -1.443371 0.00018
C  5.345866 -0.064294 0.000236
H  0.913431 -2.118854 -0.000102
H  2.301914 2.712425 0.000084
H  -0.04199 3.432699 -0.000056
H  -2.496451 2.865822 -0.000244
H  -0.999409 -2.542608 -0.000026
H  3.26912 -2.825051 0.000041
H  4.712739 2.005183 0.000232
H  -3.398317 -3.104204 0.000339
H  5.693865 -2.231988 0.00023
H  6.414296 0.177201 0.000325
