program: Gaussian 09
title: 000011850
version: EM64L-G09RevD.01
frameworkgroup: C1[X(C6H14O6)]
method: RPBEPBE
basis: SDD
operation: Freq
keyword: #pfreq=noraman
keyword: PBEPBE/SDD
title: #p freq=noraman PBEPBE/SDD
converged: YES YES NO NO
title: Mulliken charges:
elementType: O O O O O O C C C C C C H H H H H H H H H H H H H H
charge: -0.448927 -0.460510 -0.511048 -0.491166 -0.439062 -0.424249 -0.127650 -0.105760 -0.152397 -0.149898 -0.325346 -0.370281 0.246030 0.243440 0.269363 0.245451 0.210713 0.212107 0.247429 0.185608 0.357976 0.367730 0.373082 0.358931 0.349328 0.339104
chargesum: 0.00000
title: Mulliken charges with hydrogens summed into heavy atoms:
elementType: O O O O O O C C C C C C
charge: -0.090951 -0.092780 -0.137966 -0.132234 -0.089733 -0.085146 0.118379 0.137680 0.116966 0.095554 0.097475 0.062757
polarizability: 9.75312480e+01 -2.02120372e+00 8.43099363e+01 3.45309797e+00 -9.93293276e-01 7.62750732e+01
1716.lowfreq: -5.4455 -0.0011 -0.0010 -0.0009 11.0616 18.4904 40.2667 48.4198 77.2928
frequency: 39.9292 48.3212 77.2539 87.3627 121.9912 130.9294 189.6376 197.2216 211.7055 229.0804 258.0522 285.1246 299.4203 325.2481 345.1032 372.3516 421.8072 442.5588 487.2056 511.4176 523.0105 537.3636 586.1133 640.3074 709.6265 805.5075 836.5890 900.0481 949.6008 959.0107 967.8473 989.0615 1018.7642 1023.8141 1036.8387 1058.2442 1070.7105 1089.2013 1137.0751 1146.8259 1163.3702 1204.9514 1242.0855 1252.8420 1273.4506 1275.3043 1294.7645 1318.4195 1344.2914 1349.2637 1352.7164 1366.2092 1377.3039 1383.3688 1389.7052 1399.2525 1464.8967 1466.4896 2941.2324 2976.4068 2988.9695 3030.0397 3041.8103 3045.6253 3080.4477 3095.1855 3452.5232 3478.2461 3522.7710 3554.1361 3596.3235 3600.0102
redmass: 4.3094 6.2270 5.3323 4.9995 3.5837 3.2360 4.9494 2.4314 1.7920 2.5887 5.4892 4.0621 2.9805 1.3729 1.2147 3.0191 4.3732 5.2018 1.2493 1.9278 2.1361 1.5671 1.1130 3.8087 3.9912 3.4228 3.2060 2.7260 2.5819 3.8313 4.3162 3.6029 2.9563 1.8402 3.3605 2.0012 2.0964 2.1819 1.1463 1.1569 1.3598 1.4516 1.2620 1.3331 1.3403 1.3603 1.2292 1.2562 1.2171 1.2577 1.2930 1.3693 1.2628 1.2289 1.3685 1.4646 1.0873 1.0804 1.0703 1.0663 1.0847 1.0845 1.0853 1.0871 1.0978 1.0941 1.0644 1.0646 1.0648 1.0663 1.0668 1.0667
irintensity: 6.4000 1.2378 4.8638 0.3656 2.1914 20.6953 6.9387 55.2468 43.5311 37.7865 50.7873 17.1845 3.8965 167.5909 67.5406 64.8618 8.7181 2.4884 153.1826 88.4328 51.5494 42.1206 220.7349 45.8563 16.0273 29.9155 16.4881 49.3533 34.7316 24.4403 131.1135 51.2411 58.9860 78.3191 20.0973 46.5407 5.7460 2.9347 36.0591 26.9084 15.3620 56.6043 42.0538 21.1427 44.5487 0.4031 5.5019 9.9234 16.1607 12.9014 20.5425 35.3701 3.6362 22.4555 57.8959 15.0224 4.1273 6.4232 87.2441 39.5811 21.0353 2.4082 10.4926 24.0841 28.2800 12.3664 30.0996 35.3951 9.4111 7.0509 17.8366 11.2518
temp: 298.150 k
press: 1.00000 atm
elementType: 8 8 8 8 8 8 6 6 6 6 6 6 1 1 1 1 1 1 1 1 1 1 1 1 1 1
symmnumber: 1
zpe: 552613.1 jmol-1
zpe.correction: 0.210479 hartree
zpe.thermalcorrener: 0.225157 hartree
zpe.thermalcorrenthalpy: 0.226101 hartree
zpe.thermalcorrgfe: 0.168863 hartree
zpe.sumelectzpe: -687.319434 hartree
zpe.sumelectthermal: -687.304757 hartree
zpe.sumelectthermalent: -687.303813 hartree
zpe.sumelectthermalfe: -687.361051 hartree
dipole: 4.1239 -0.2430 1.3961
dipole: 4.3606
quadrupole: -79.4656 -68.2543 -75.2311
quadrupole: -10.2617 10.0190 -1.9121
quadrupole: -5.1486 6.0627 -0.9141 -10.2617 10.0190 -1.9121
hfenergy: -687.5299137 hartree
pointgroup: C01 [X(C6H14O6)]
dipole: -1.6107144 0.4972295 0.318817 debye
dipolederiv: -0.7144693 -0.0549661 -0.0314306 -0.081279 -0.2530264 -0.0424971 -0.0826749 -0.0344735 -0.7428415 -0.7311894 -0.0371243 -0.0306203 -0.0789964 -0.2552933 -0.0965968 -0.0691173 -0.0670247 -0.7683004 -0.639198 0.1329845 0.1390761 0.164232 -0.7500553 0.1492319 0.1342442 0.1936671 -0.3579959 -0.4381391 -0.0977841 -0.1241834 -0.0657259 -0.7706529 0.2005989 -0.1485848 0.1836417 -0.5341412 -0.8788609 0.1384985 -0.0563142 0.1664941 -0.4139872 -0.1766077 -0.0875244 -0.1692591 -0.4165815 -0.6864759 -0.1041144 0.0816625 -0.1172349 -0.4453205 0.321616 0.0752748 0.3464641 -0.4306647 0.2199183 0.0351195 0.0558571 0.0214791 0.1738626 -0.0310767 0.1605326 -0.048336 0.419784 0.259807 0.0306663 0.0420135 0.0165718 0.1274734 -0.000236 0.1858217 -0.0104519 0.5124561 0.1458204 0.0204591 -0.0305341 -0.1159114 0.5308949 -0.1463927 -0.1265424 -0.1321948 0.1551161 0.16606 -0.0155006 0.0892094 -0.0445708 0.477105 -0.1620581 -0.0217509 -0.1575265 0.3002016 0.4974904 -0.1963172 -0.0548948 -0.0885707 0.3221765 0.0923628 0.0122442 0.0751536 0.3190005 0.3362568 -0.0404953 -0.0492769 0.0379527 0.3432035 -0.1713461 -0.0488429 -0.1603592 0.388995 0.0991281 -0.0011664 -0.0048776 -0.0234529 -0.0896113 0.064831 0.009302 0.0343342 0.0158962 0.11089 0.0086217 -0.0294908 -0.0064601 -0.0681207 0.0661747 -0.0337326 0.0450476 -0.0050122 0.1266663 -0.0011075 0.011517 -0.0176846 -0.0082067 -0.0364642 0.0136686 -0.0011408 -0.0789202 0.0923003 -0.0228738 0.0270642 -0.0202419 -0.0067227 -0.0499063 0.0185221 -0.0176986 -0.1360841 0.0129801 0.043108 0.0294078 0.031582 0.0309357 -0.0523576 0.0049864 -0.11632 -0.1447546 0.0583936 0.0170689 0.0061559 0.0363057 -0.0633529 0.0753658 -0.0000437 0.1178302 0.0190874 0.1129265 0.0097033 0.0095421 -0.0291957 0.0303681 -0.0486649 -0.0462051 -0.041046 -0.0628459 -0.1795989 0.1111994 0.0003095 0.1459493 -0.1094277 0.0657108 0.0381441 0.019708 0.0349438 0.3778013 0.015101 -0.0456555 0.0357935 0.1393668 0.053746 -0.0335864 0.0123734 0.3355772 0.4122676 0.0026906 -0.0402838 0.0086826 0.1626781 0.0580992 -0.0461293 0.0343052 0.3354664 0.2847923 -0.127795 -0.0817937 -0.1185372 0.2550566 -0.0470697 -0.0885587 -0.0674367 0.1969358 0.1195707 0.159619 0.0787107 0.1115786 0.3275219 -0.0177176 0.1314626 -0.0300285 0.2801107 0.4201799 -0.0492234 0.0720836 -0.0069112 0.1545131 0.106096 0.084098 0.1162441 0.244478 0.4146819 0.0236281 -0.0632536 0.0381516 0.1586216 -0.1748417 -0.035008 -0.1254728 0.1200933 unknown
polarizability: 97.3312542|-4.270923|81.4441997|-1.0949173|-4.0009355|79.3408036 unknown
InChI: InChI=1S/C6H14O6/c7-1-3(9)5(11)6(12)4(10)2-8/h3-12H,1-2H2
charge 0 multiplicity 1
26 atoms
O  0.501176 0.539686 1.70674
O  -0.712273 -0.42709 -1.724025
O  1.97569 -1.453505 0.552401
O  -2.049978 1.690049 -0.901706
O  4.27625 -0.15966 -0.314809
O  -3.316826 -1.294427 1.05191
C  0.524521 0.503296 0.234506
C  -0.758666 -0.209076 -0.272542
C  1.809506 -0.19796 -0.249734
C  -2.018761 0.59553 0.099132
C  3.081736 0.616706 0.018926
C  -3.305254 -0.251684 0.017491
H  0.517994 1.559435 -0.092445
H  -0.832743 -1.210555 0.19029
H  1.723831 -0.449486 -1.322509
H  -1.887627 1.006312 1.122147
H  3.095773 0.946206 1.078724
H  3.10638 1.506057 -0.633018
H  -3.342456 -0.794644 -0.94054
H  -4.202295 0.402365 0.098685
H  0.889332 -0.333686 1.994711
H  -1.043867 0.416771 -2.137918
H  1.549149 -2.207948 0.076163
H  -2.828417 2.278787 -0.748416
H  4.171046 -1.034007 0.145573
H  -3.326121 -0.867269 1.946363
