program: Gaussian 09
title: 000135538
version: EM64L-G09RevD.01
frameworkgroup: C1[X(C7H10N2O)]
method: RPBEPBE
basis: SDD
operation: Freq
keyword: #p
keyword: freq=noraman
keyword: PBEPBE/SDD
title: #p freq=noraman PBEPBE/SDD
converged: YES YES NO NO
title: Mulliken charges:
elementType: O N N C C C C C C C H H H H H H H H H H
charge: -0.447115 -0.404561 -0.586682 0.373852 0.458188 -0.321152 -0.399446 -0.421662 -0.375178 -0.450517 0.246527 0.224872 0.212459 0.260397 0.189673 0.217892 0.283693 0.333188 0.302724 0.302845
chargesum: 0.00000
title: Mulliken charges with hydrogens summed into heavy atoms:
elementType: O N N C C C C C C C
charge: -0.113927 -0.120868 0.018887 0.373852 0.458188 -0.074624 -0.174573 -0.209203 -0.114781 -0.042952
polarizability: 1.42283464e+02 1.08260408e+00 9.16352784e+01 -4.71756764e+00 -7.85607964e-01 5.27900828e+01
1716.lowfreq: -13.1185 -4.7509 -0.0008 -0.0007 -0.0005 7.9396 33.2399 74.4428 114.3098
frequency: 33.0240 74.4305 114.3087 193.1905 203.6828 216.8379 258.8429 298.7981 356.1700 387.3361 410.8247 451.1172 519.0272 577.4998 601.0094 635.0540 718.0746 760.4035 816.6891 828.2945 843.8451 926.4195 942.3281 962.8932 967.9094 996.6960 1106.3800 1151.6731 1166.9910 1181.6882 1209.8952 1221.4144 1279.9251 1297.1417 1325.1753 1364.5968 1379.7382 1421.5212 1470.5914 1485.7073 1511.2566 1590.4817 1623.5417 1657.7393 2957.6399 3051.8420 3107.4276 3114.1916 3141.9989 3168.2558 3471.4354 3488.3721 3551.2946 3621.0270
redmass: 3.7618 3.3314 4.9207 2.2046 1.4446 4.3834 1.1352 1.9870 1.8316 2.9731 3.0411 4.5325 2.5704 1.2525 3.2710 6.5677 3.4237 4.0906 1.5372 3.4270 1.6039 3.0958 1.6218 1.4358 1.5212 2.6978 1.3971 1.1406 1.8708 1.5290 1.1893 2.6571 1.2899 1.4051 2.4270 1.4750 2.2656 4.2594 1.1096 1.5100 2.9756 4.7343 3.6297 1.2809 1.0676 1.0955 1.0876 1.0894 1.0954 1.0933 1.0688 1.0465 1.0661 1.1085
irintensity: 1.6473 15.8800 7.4599 21.5080 305.9071 20.3676 81.9695 34.5972 101.7257 39.7221 0.8396 18.6329 6.0727 41.7012 25.4713 0.4756 7.1274 14.4769 37.0043 3.3018 42.0343 77.7869 20.1625 2.4456 2.1940 0.2163 14.2456 14.7756 42.1321 0.0884 2.7833 24.2785 10.5009 0.6105 38.7034 25.9808 45.6350 3.3854 2.4958 22.3548 109.7899 0.3136 96.8820 58.1885 78.5888 28.6902 22.5126 17.4922 15.0820 4.8113 15.5092 17.5312 3.6794 4.1530
temp: 298.150 k
press: 1.00000 atm
elementType: 8 7 7 6 6 6 6 6 6 6 1 1 1 1 1 1 1 1 1 1
symmnumber: 1
zpe: 425952.2 jmol-1
zpe.correction: 0.162237 hartree
zpe.thermalcorrener: 0.172730 hartree
zpe.thermalcorrenthalpy: 0.173674 hartree
zpe.thermalcorrgfe: 0.125873 hartree
zpe.sumelectzpe: -456.672512 hartree
zpe.sumelectthermal: -456.662018 hartree
zpe.sumelectthermalent: -456.661074 hartree
zpe.sumelectthermalfe: -456.708876 hartree
dipole: -5.0495 -0.1633 0.3988
dipole: 5.0678
quadrupole: -54.5020 -54.2342 -58.6961
quadrupole: -4.9625 -1.7085 -0.8816
quadrupole: 1.3088 1.5766 -2.8853 -4.9625 -1.7085 -0.8816
hfenergy: -456.8347487 hartree
pointgroup: C01 [X(C7H10N2O1)]
dipole: 1.9794183 -0.1328742 -0.1990401 debye
dipolederiv: -0.8824899 -0.1300516 -0.2037665 -0.1246969 -0.3955009 0.147435 -0.3737507 0.1464311 -0.5118525 -1.0096422 -0.1839877 0.0771309 -0.1768909 0.1482795 -0.1004322 0.116699 -0.0953154 -0.5182176 -0.3857132 -0.2669567 0.0997982 -0.5828008 -0.4360967 0.1479891 0.1511141 0.1160808 0.0051641 -0.3344391 -0.0068038 -0.0489361 -0.0626659 -0.2564466 0.0610686 0.0195986 0.0316901 -0.1772335 1.5412688 0.1442303 -0.183915 0.3120509 -0.0563702 0.0025496 -0.2370074 0.019018 0.1511071 0.1985792 0.0994671 -0.0453142 0.0407843 0.1555891 -0.0442263 0.0013935 -0.0505621 -0.1241726 0.2730087 -0.1056794 -0.0288603 -0.042204 0.1374516 -0.0601378 -0.0808539 -0.047389 -0.1318616 -0.4790117 -0.0880851 0.0314283 0.3064124 0.0721651 -0.0864723 -0.0297498 -0.050717 -0.2219907 -0.4168542 0.0080328 0.0064356 -0.440479 -0.0352893 0.0116709 0.1096058 -0.0366189 -0.2265124 0.7632415 0.0428606 0.1082288 0.084222 0.3514784 -0.0878313 0.1860856 -0.0885756 0.559841 0.0263751 0.1013232 0.0045772 0.0919862 -0.0191156 0.0169182 0.0045887 0.0164812 0.1432255 0.0444605 -0.0929465 0.0296825 -0.0783519 -0.0842529 0.0492682 0.0263902 0.0520654 0.1295143 0.0166826 -0.1086449 0.0354964 -0.0879932 -0.0861816 0.0530336 0.0293749 0.0589283 0.1511444 0.0537951 0.0817611 -0.0013214 0.081762 -0.0002592 0.0210538 0.0024285 0.0203201 0.1700351 0.0127265 0.0075203 -0.0335557 -0.0863668 -0.192501 0.1289797 -0.0102216 0.0700045 -0.0054015 -0.0792154 0.0242531 0.0587163 0.1060105 0.0179443 -0.1179785 0.0244093 -0.0553117 -0.0618832 0.0918539 0.0773958 0.016589 0.1186883 -0.0368801 0.0563781 0.002617 0.057958 0.3406805 0.3391223 0.1256346 0.1332408 0.1436972 0.2239272 -0.0992661 0.1376239 -0.0775751 0.1275646 0.0980759 0.1247658 -0.0860359 0.1854817 0.2405093 -0.0762175 -0.0995014 -0.0426419 0.1185069 0.1281753 0.1459111 0.0303809 0.2113539 0.2515492 -0.0237828 0.0191557 -0.0442708 0.082342 unknown
polarizability: 141.8406737|-3.2352446|90.3240384|-7.1371864|-7.1207165|54.5441134 unknown
InChI: InChI=1S/C7H10N2O/c8-9-7-3-1-6(5-10)2-4-7/h1-4,9-10H,5,8H2
charge 0 multiplicity 1
20 atoms
O  -3.695563 0.160457 -0.664514
N  2.789225 0.45773 -0.335489
N  3.716942 -0.573642 -0.255058
C  -1.39704 -0.092192 0.291402
C  1.413513 0.250978 -0.125906
C  -0.85465 1.187788 -0.004963
C  -0.503574 -1.190031 0.368702
C  0.52463 1.36392 -0.211852
C  0.883821 -1.03377 0.167603
C  -2.886928 -0.273417 0.50136
H  -1.530136 2.048184 -0.079561
H  -0.899776 -2.189117 0.593604
H  0.922258 2.361911 -0.439538
H  1.571378 -1.881809 0.230103
H  -3.108335 -1.3320 0.754498
H  -3.270159 0.363559 1.317767
H  3.107966 1.409216 -0.539132
H  -3.294518 -0.237957 -1.478924
H  4.294269 -0.628043 0.584034
H  4.098877 -0.935963 -1.128438
