program: Gaussian 09
title: 000135567
version: EM64L-G09RevD.01
frameworkgroup: C1[X(C20H15N5)]
method: RPBEPBE
basis: SDD
operation: Freq
keyword: #pfreq=noraman
keyword: PBEPBE/SDD
title: #p freq=noraman PBEPBE/SDD
converged: YES YES NO NO
title: Mulliken charges:
elementType: N N N N N C C C C C C C C C C C C C C C C C C C C H H H H H H H H H H H H H H H
charge: -0.509721 -0.403327 -0.107709 -0.401589 -0.107647 0.216718 0.298976 0.308816 -0.510824 0.364686 -0.528764 0.446546 -0.421200 -0.415198 -0.405609 -0.388946 0.394307 0.085162 -0.381754 -0.411123 0.101027 -0.226181 -0.311147 -0.220835 -0.308016 0.310614 0.252532 0.197422 0.240349 0.276589 0.233517 0.205992 0.194847 0.278339 0.307739 0.312412 0.259809 0.254842 0.261787 0.256562
chargesum: 0.00000
title: Mulliken charges with hydrogens summed into heavy atoms:
elementType: N N N N N C C C C C C C C C C C C C C C C C C C C
charge: -0.199106 -0.095587 -0.107709 -0.089177 -0.107647 0.216718 0.298976 0.308816 -0.258292 0.364686 -0.331342 0.446546 -0.180851 -0.138609 -0.172093 -0.182954 0.394307 0.085162 -0.186908 -0.132784 0.101027 0.033628 -0.056305 0.040952 -0.051454
polarizability: 7.19632210e+02 -1.87593786e+00 2.41280549e+02 -2.51180590e+00 -3.34024121e+00 9.85998024e+01
1716.lowfreq: -7.3354 -2.9116 -0.0004 0.0008 0.0011 0.2483 19.6831 22.9976 34.9726
frequency: 19.5950 22.9793 34.9563 40.6344 45.7287 66.4193 102.3379 113.1234 158.4012 175.9145 184.6789 226.4192 266.4256 303.4710 316.6062 340.4419 394.6512 402.2469 418.4226 432.5094 444.2909 459.5543 506.9764 518.5263 534.2517 601.4331 609.2946 618.2387 623.7532 632.1757 637.6304 642.4430 657.0208 679.2255 700.0775 711.7816 715.9462 727.8927 733.5306 743.8744 755.5398 803.3024 809.4666 826.2763 843.8248 847.1891 849.6839 851.8428 857.6702 881.0969 893.0923 910.3600 923.4805 927.6820 947.2810 955.3855 986.1242 987.5551 1002.5419 1041.9612 1044.4451 1061.3837 1080.5184 1083.0347 1106.6128 1111.1082 1120.0078 1132.8888 1167.2674 1170.6256 1193.0449 1202.8978 1224.2954 1244.1435 1279.9322 1282.3801 1299.9386 1308.2424 1324.4128 1328.0856 1344.3238 1348.8453 1360.1576 1372.7541 1386.5313 1404.2399 1428.9046 1438.9660 1447.3202 1470.3517 1481.3894 1489.2513 1525.3036 1555.0086 1565.5791 1570.6376 1584.4431 1624.0713 1637.3261 3113.0522 3113.3219 3119.5765 3140.9614 3152.8077 3166.6842 3172.1020 3217.3798 3226.1879 3228.2467 3255.8109 3257.6243 3596.3649 3596.9893 3611.0197
redmass: 4.6412 5.2073 4.6854 5.7345 3.9944 5.1515 5.6433 5.6369 5.0979 8.2776 5.9663 4.5078 4.8135 5.6849 7.6677 5.4164 5.1500 2.8296 5.5253 2.9822 5.7508 4.8874 2.0248 1.7770 2.4842 6.3207 3.7906 2.7538 2.1022 6.6237 1.5726 1.3085 2.8936 7.1039 5.4718 6.9721 3.8464 1.4190 1.2607 2.5275 3.2996 1.6698 3.3922 1.4038 1.8778 1.3635 1.4666 1.4906 1.6347 5.7200 6.0559 6.2997 6.3336 5.0406 3.5370 1.4180 1.3357 1.3725 3.2354 1.9842 2.6598 1.8001 1.5470 1.5898 2.2991 2.6009 1.4603 1.5136 2.1436 2.0803 1.5381 1.1305 2.3475 1.5241 3.1389 2.4880 1.7564 1.5287 3.5028 2.9262 2.6506 2.9153 2.9089 2.8250 5.6144 4.6872 3.9741 3.7410 3.9739 4.2769 2.7321 3.5555 4.9510 5.1846 6.7492 5.6582 5.2836 6.2183 6.9336 1.0884 1.0906 1.0890 1.0893 1.0946 1.0949 1.0955 1.0973 1.0917 1.0919 1.1084 1.1083 1.0815 1.0813 1.0800
irintensity: 9.4767 7.8434 0.1376 1.8170 4.8390 0.2536 0.5094 0.3430 8.7854 0.1849 2.4138 6.6102 0.6223 3.2058 6.0712 1.1726 0.8311 0.9202 18.2028 1.8974 0.5288 0.2921 10.5296 46.9523 31.1862 1.3454 2.1171 2.9611 18.4399 1.3314 62.0065 115.5433 3.4155 0.3658 14.1696 1.5999 43.7022 43.3371 63.8128 1.1500 1.9471 21.2772 4.8064 23.8645 28.4055 24.4600 78.6169 19.7841 39.8298 2.8303 2.4584 23.9310 2.0895 25.7962 6.3906 0.1529 0.7337 1.5308 0.1334 2.1516 3.8360 9.2273 26.9174 31.9653 38.9413 43.5201 12.8674 9.9755 10.5693 26.8932 12.0498 0.8228 6.1528 15.1924 10.8392 43.3046 3.3153 3.7849 0.6198 14.8858 14.2907 2.4933 33.1787 5.6736 33.0855 31.3762 14.0602 3.5562 16.6092 43.1845 54.6517 123.1436 19.2987 25.2881 9.4967 10.2548 10.3202 22.5461 0.5036 59.3835 10.2634 21.8642 10.0816 12.6162 0.7140 4.9639 6.7787 11.1123 10.2837 6.3577 4.9543 29.5750 14.5596 33.7037
temp: 298.150 k
press: 1.00000 atm
elementType: 7 7 7 7 7 6 6 6 6 6 6 6 6 6 6 6 6 6 6 6 6 6 6 6 6 1 1 1 1 1 1 1 1 1 1 1 1 1 1 1
symmnumber: 1
zpe: 808879.2 jmol-1
zpe.correction: 0.308086 hartree
zpe.thermalcorrener: 0.327385 hartree
zpe.thermalcorrenthalpy: 0.328329 hartree
zpe.thermalcorrgfe: 0.257146 hartree
zpe.sumelectzpe: -1043.224621 hartree
zpe.sumelectthermal: -1043.205322 hartree
zpe.sumelectthermalent: -1043.204378 hartree
zpe.sumelectthermalfe: -1043.275561 hartree
dipole: 3.5334 -1.0242 -1.1120
dipole: 3.8433
quadrupole: -133.4721 -123.7422 -154.9597
quadrupole: 43.8557 -3.2146 -0.2065
quadrupole: 3.9192 13.6492 -17.5684 43.8557 -3.2146 -0.2065
hfenergy: -1043.532707 hartree
pointgroup: C01 [X(C20H15N5)]
dipole: -1.3969775 -0.3974533 0.4204721 debye
polarizability: 719.6295561|-2.3283714|241.1465727|2.3556777|5.5462451|98.736433 unknown
InChI: InChI=1S/C20H15N5/c1-3-14(19-21-7-8-22-19)4-2-13(1)17-11-15-5-6-16(12-18(15)25-17)20-23-9-10-24-20/h1-12,21,23,25H
charge 0 multiplicity 1
40 atoms
N  0.705259 -0.469191 0.047049
N  6.023888 -1.822065 0.193599
N  6.939207 0.236611 0.061147
N  -6.944704 0.624186 0.212355
N  -6.527511 -1.547948 -0.242328
C  2.008074 0.036835 0.026788
C  1.904312 1.472231 -0.071484
C  -0.223485 0.59204 -0.023449
C  0.501764 1.794291 -0.098902
C  -1.669752 0.357667 -0.025063
C  3.245498 -0.632955 0.087557
C  4.427884 0.150026 0.041892
C  3.103577 2.236816 -0.121053
C  4.338968 1.579718 -0.063639
C  -2.574145 1.425282 0.240828
C  -2.227635 -0.928993 -0.288444
C  -4.513147 -0.068688 -0.014437
C  5.765095 -0.449757 0.096715
C  -3.963324 1.219348 0.243102
C  -3.615408 -1.13934 -0.28076
C  -5.95256 -0.335612 -0.017277
C  7.410332 -2.00752 0.220141
C  7.953645 -0.721433 0.137209
C  -8.190094 -0.005087 0.129145
C  -7.90651 -1.34631 -0.152529
H  0.456925 -1.446705 0.179413
H  0.071142 2.788978 -0.199535
H  3.278667 -1.726963 0.163854
H  3.063573 3.328408 -0.200708
H  5.27995 2.136392 -0.096963
H  -2.177938 2.420879 0.466005
H  -1.574808 -1.774752 -0.536797
H  -4.614624 2.075583 0.459674
H  -4.039986 -2.126358 -0.487659
H  5.329925 -2.565655 0.237607
H  -6.79482 1.613056 0.40394
H  7.868165 -2.990138 0.292104
H  9.002191 -0.433653 0.127696
H  -9.125895 0.528323 0.270335
H  -8.606993 -2.165848 -0.29353
