program: Gaussian 09
title: 000135556
version: EM64L-G09RevD.01
frameworkgroup: C1[X(C12H19N5O4)]
method: RPBEPBE
basis: SDD
operation: Freq
keyword: #p
keyword: freq=noraman
keyword: PBEPBE/SDD
title: #p freq=noraman PBEPBE/SDD
converged: YES YES NO NO
title: Mulliken charges:
elementType: O O O O N N N N N C C C C C C C C C C C C H H H H H H H H H H H H H H H H H H H
charge: -0.322999 -0.297234 -0.211204 -0.233914 -0.194308 -0.145277 -0.119338 -0.138729 0.082938 0.346199 -0.711923 -0.709255 -0.703517 0.073319 0.239067 0.314393 -0.246689 -0.608387 0.233590 -0.627050 -0.628074 0.270683 0.210496 0.220336 0.267643 0.208594 0.224672 0.205553 0.228419 0.226696 0.263525 0.240500 0.267570 0.237217 0.230758 0.242753 0.277592 0.247572 0.265953 0.271862
chargesum: 0.00000
title: Mulliken charges with hydrogens summed into heavy atoms:
elementType: O O O O N N N N N C C C C C C C C C C C C
charge: -0.322999 -0.297234 -0.211204 -0.233914 -0.194308 -0.145277 -0.119338 -0.138729 0.082938 0.346199 -0.010408 -0.008346 -0.042849 0.073319 0.239067 0.314393 0.016835 0.136900 0.233590 0.124052 0.157312
polarizability: 2.24576028e+02 -2.77690537e-01 2.00969804e+02 -1.30979884e+01 -6.88323723e-01 1.38324640e+02
1716.lowfreq: -9.4495 -5.0433 -3.0608 -0.0010 -0.0009 -0.0006 22.1918 32.0756 38.9892
frequency: 22.0536 31.9841 38.9778 56.1055 67.9206 79.4430 87.7107 103.3235 113.4384 123.2995 133.1124 143.9193 158.2326 176.8748 181.9148 203.5355 225.6098 231.7246 241.9790 246.0367 248.9766 274.8669 315.3063 324.2253 332.1406 340.0186 361.3040 388.0216 393.2462 404.8296 426.4254 437.4858 450.4071 487.2758 552.5242 585.1822 618.7814 661.6746 674.6867 700.5709 734.2730 740.8152 766.0034 770.2067 783.6978 809.2235 864.2317 907.9535 914.6119 921.1270 949.8883 954.1985 1014.5896 1028.9556 1032.0310 1061.9536 1105.7264 1112.7606 1119.2318 1123.6078 1142.6479 1170.9250 1178.6529 1191.5764 1235.7004 1256.9976 1259.4498 1280.8144 1298.2912 1322.6552 1356.0020 1358.7083 1373.7824 1377.3034 1399.0465 1403.0632 1411.2316 1427.8962 1437.3282 1443.9470 1459.5958 1461.5187 1465.6148 1466.2892 1468.0715 1470.2468 1470.3597 1473.8239 1478.1086 1485.6954 1498.8379 1500.8624 1541.3113 1588.7836 1614.3378 2989.9635 2990.9438 2996.1797 3002.1791 3008.1043 3008.8548 3081.4126 3084.8922 3095.9366 3096.2936 3096.5757 3098.3923 3100.2477 3115.2032 3115.9499 3120.3450 3138.1403 3149.5011 3237.0233
redmass: 3.8746 4.8707 4.0004 3.7265 4.1053 1.2317 3.6418 3.4045 2.1346 2.1150 1.2509 2.0214 1.2782 3.5426 3.8177 4.0533 1.2117 2.8102 1.4759 2.9556 3.0028 3.8687 3.9562 3.5738 2.8188 3.3189 4.5933 4.6474 5.7865 2.9422 5.7643 3.1153 3.1758 5.5078 7.4312 4.9183 4.3569 6.4965 6.6618 10.3394 7.2033 7.6765 6.6752 6.0343 1.4995 3.3913 5.1532 3.3147 1.6012 1.8102 4.3926 1.2031 4.1573 1.4211 1.4270 1.7679 2.4012 1.3553 1.3357 1.3214 3.3768 2.6041 2.4807 2.2272 2.6022 3.0322 3.6476 4.6526 5.8629 3.8227 10.3031 7.3272 1.2284 1.2365 1.2226 1.6301 1.7284 2.1632 1.2397 1.0468 1.0620 1.1587 1.0566 1.0593 1.0855 1.3305 1.1929 1.1187 1.0542 1.1492 1.1113 1.0631 6.9689 10.7562 9.9497 1.0362 1.0358 1.0367 1.0334 1.0343 1.0333 1.0993 1.0991 1.1009 1.1019 1.0991 1.1004 1.1013 1.1017 1.0999 1.0992 1.1021 1.1013 1.0987
irintensity: 0.6152 1.9626 0.6160 0.7249 4.7015 0.9562 6.5526 0.6173 2.8814 0.8374 0.1971 2.9640 0.7212 10.6727 1.0842 9.6845 1.4018 3.4829 0.7352 0.8469 2.9409 2.5667 16.2493 4.9741 3.2605 0.5559 13.6854 3.1614 1.5384 0.8467 2.6308 2.3965 2.6375 7.3939 0.4415 23.5077 13.2102 3.4742 8.9077 13.4686 6.3615 6.7332 33.7087 59.7119 23.5921 7.7965 18.3294 148.3001 2.1439 67.7190 172.1287 0.1989 57.8678 0.0179 7.0764 28.5475 546.8645 1.3972 3.7203 29.6830 77.4637 182.4652 22.3894 17.4706 43.2352 23.5164 65.7307 18.7054 108.1099 110.8332 136.5663 26.1760 40.4803 40.9618 35.0865 41.8584 23.6205 150.5421 6.0193 0.8799 25.4294 22.0326 1.8192 21.9410 18.6558 47.2889 6.2601 29.1410 3.3376 60.8442 8.3867 36.1857 157.8548 171.0753 269.1101 19.7024 13.2473 35.0694 43.2157 46.5610 9.4070 8.9296 14.2843 11.6853 10.5665 58.2047 23.6387 26.1653 11.7547 4.2147 17.3591 2.1219 0.1841 1.3792
temp: 298.150 k
press: 1.00000 atm
elementType: 8 8 8 8 7 7 7 7 7 6 6 6 6 6 6 6 6 6 6 6 6 1 1 1 1 1 1 1 1 1 1 1 1 1 1 1 1 1 1 1
symmnumber: 1
zpe: 823364.8 jmol-1
zpe.correction: 0.313603 hartree
zpe.thermalcorrener: 0.337132 hartree
zpe.thermalcorrenthalpy: 0.338076 hartree
zpe.thermalcorrgfe: 0.259892 hartree
zpe.sumelectzpe: -1041.665856 hartree
zpe.sumelectthermal: -1041.642327 hartree
zpe.sumelectthermalent: -1041.641383 hartree
zpe.sumelectthermalfe: -1041.719567 hartree
dipole: 0.4624 0.1316 1.4497
dipole: 1.5274
quadrupole: -94.1111 -122.2350 -133.4059
quadrupole: 7.9501 6.9346 -5.0302
quadrupole: 22.4729 -5.6510 -16.8219 7.9501 6.9346 -5.0302
hfenergy: -1041.9794588 hartree
pointgroup: C01 [X(C12H19N5O4)]
dipole: 0.3211306 -0.4015498 0.3110062 debye
polarizability: 211.9385009|29.0338424|165.4477952|-15.8342799|22.8752165|186.4841759 unknown
InChI: InChI=1S/C12H19N5O4/c1-12(2,3)21-11(19)16(5)9-8(15(4)7-13-9)10(18)17(6)14-20/h7H,1-6H3
charge 0 multiplicity 1
40 atoms
O  -2.773025 -0.406044 0.823698
O  -0.917254 -0.199777 -0.622682
O  1.31787 -1.783743 0.374585
O  2.497875 0.759172 -3.22551
N  -0.863231 0.558583 1.610102
N  2.606287 1.454533 1.02505
N  0.864421 2.115347 2.317431
N  2.03855 -0.543497 -1.458032
N  2.229329 0.750326 -1.976098
C  -3.651658 -1.099275 -0.216192
C  -3.880577 -0.145921 -1.405525
C  -2.996273 -2.430711 -0.633156
C  -4.947791 -1.333101 0.57873
C  0.46883 1.027105 1.53991
C  1.531596 0.5887 0.720596
C  -1.471253 -0.035005 0.500576
C  2.15486 2.332818 1.993315
C  -1.629769 0.799048 2.858894
C  1.608885 -0.647906 -0.088375
C  3.963133 1.426569 0.463459
C  2.087808 -1.727302 -2.333238
H  -2.939297 0.048319 -1.942488
H  -4.603205 -0.601999 -2.10699
H  -4.300511 0.813817 -1.055391
H  -2.05813 -2.255808 -1.181942
H  -3.6922 -2.991171 -1.284043
H  -2.780118 -3.049437 0.255542
H  -5.69295 -1.83867 -0.061086
H  -4.753556 -1.966868 1.461152
H  -5.37233 -0.374234 0.922837
H  2.789193 3.099835 2.43096
H  -2.57329 1.320636 2.634307
H  -1.010351 1.427903 3.513831
H  -1.865728 -0.158643 3.353143
H  4.615337 2.062635 1.08295
H  4.365077 0.398895 0.475331
H  3.95828 1.800528 -0.572955
H  3.073237 -1.794809 -2.823945
H  1.315154 -1.640364 -3.116401
H  1.894775 -2.608084 -1.705449
