program: Gaussian 09
title: 000011847
version: EM64L-G09RevD.01
frameworkgroup: C1[X(C6H4Br2O)]
method: RPBEPBE
basis: SDD
operation: Freq
keyword: #p
keyword: freq=noraman
keyword: PBEPBE/SDD
title: #p freq=noraman PBEPBE/SDD
converged: NO NO NO NO
title: Mulliken charges:
elementType: Br Br O C C C C C C H H H H
charge: 0.057566 0.033147 -0.390779 0.521557 -0.348559 -0.372245 -0.177333 -0.190489 -0.242324 0.254280 0.253302 0.243567 0.358310
chargesum: 0.00000
title: Mulliken charges with hydrogens summed into heavy atoms:
elementType: Br Br O C C C C C C
charge: 0.057566 0.033147 -0.032469 0.521557 -0.348559 -0.372245 0.076947 0.062812 0.001243
polarizability: 1.49012119e+02 1.12212687e+00 1.08384974e+02 -2.59303218e-03 3.72348966e-03 3.36296919e+01
1716.lowfreq: -0.0001 0.0004 0.0006 3.2880 6.6423 12.7336 83.9977 129.9706 184.4564
frequency: 83.9838 129.9703 184.4550 236.9493 256.5567 262.6329 311.1558 422.2743 494.3047 496.4817 538.6128 555.3392 690.6013 718.2085 762.7315 806.3725 896.9861 961.1420 1023.6688 1060.5401 1120.5208 1161.8253 1223.8132 1273.4413 1371.7297 1416.6421 1444.7345 1562.6026 1579.9260 3152.2554 3166.3933 3181.1715 3498.8129
redmass: 11.8615 24.7938 4.4936 7.0750 17.7150 5.7353 7.8489 1.0985 5.3121 4.9889 3.5944 8.8467 7.9400 4.3986 1.3692 6.3429 1.3471 1.3270 8.9371 2.1965 1.6826 1.1347 1.8748 1.7362 6.3237 2.6002 2.9451 6.5061 7.8477 1.0867 1.0928 1.0999 1.0649
irintensity: 0.1332 0.0128 0.7631 4.5581 0.7625 8.1746 4.4357 137.8437 1.0819 14.2090 1.0168 4.0623 68.6710 27.4435 55.1324 17.5860 0.0129 0.5277 17.1612 26.2636 149.3281 32.4279 63.2989 25.2751 32.4974 73.9070 43.6695 34.3275 3.4258 1.3490 1.8262 7.1175 61.5001
temp: 298.150 k
press: 1.00000 atm
elementType: 35 35 8 6 6 6 6 6 6 1 1 1 1
symmnumber: 1
zpe: 215608.0 jmol-1
zpe.correction: 0.082121 hartree
zpe.thermalcorrener: 0.090616 hartree
zpe.thermalcorrenthalpy: 0.091560 hartree
zpe.thermalcorrgfe: 0.046508 hartree
zpe.sumelectzpe: -332.525311 hartree
zpe.sumelectthermal: -332.516816 hartree
zpe.sumelectthermalent: -332.515872 hartree
zpe.sumelectthermalfe: -332.560924 hartree
dipole: 1.5763 1.7978 0.0002
dipole: 2.3910
quadrupole: -69.1475 -61.5479 -74.2595
quadrupole: -3.6435 -0.0005 0.0007
quadrupole: -0.8292 6.7704 -5.9412 -3.6435 -0.0005 0.0007
hfenergy: -332.6074314 hartree
pointgroup: C01 [X(C6H4Br2O1)]
dipole: -0.6186921 -0.7085879 0.0000626 debye
dipolederiv: -0.5237719 -0.2529558 0.0000089 -0.2447858 -0.1382872 -0.0000066 -0.0000023 -0.0000007 0.0014336 -0.5773812 0.1879185 -0.0000169 0.2282369 -0.2203131 0.0000222 -0.0000434 -0.0000218 -0.0057631 -0.129346 0.0488961 -0.0000024 0.1460163 -1.2104491 0.0001227 0.0000077 0.0001652 -0.3800484 -0.4966903 -0.0818265 0.0000153 -0.1198279 0.9800854 -0.0001363 0.0000437 -0.0001008 0.1590741 0.9468689 0.6292728 -0.0000282 0.3420882 0.1153381 0.0000042 -0.0000267 -0.0000444 -0.154802 0.92009 -0.5739891 0.0000374 -0.3026564 0.1068371 0.0000023 0.0000249 0.0000257 -0.1604624 -0.1313051 -0.1766256 -0.0000009 -0.0243076 -0.0357813 -0.0000143 0.0000262 0.0000366 -0.078927 -0.1704263 0.1760608 0.000004 -0.0684103 -0.0562899 -0.0000196 0.0000196 -0.0000013 -0.0724714 -0.0703325 -0.0204006 -0.0000003 0.0250992 -0.0231139 0.0000084 -0.0000151 -0.0000116 -0.1815679 -0.0171028 0.0660345 0.0000054 0.0582353 0.0763221 -0.0000027 -0.0000095 -0.0000047 0.1616493 -0.0136865 -0.0680789 -0.0000033 -0.0551425 0.076385 0.0000002 0.0000035 0.0000049 0.1660624 0.0425061 0.0032774 -0.0000008 -0.000798 -0.0882511 0.0000157 -0.000011 -0.0000031 0.1761022 0.2205775 0.0624165 -0.0000183 0.0162526 0.4175178 0.0000037 -0.0000175 -0.000044 0.3697206 unknown
polarizability: 149.0072484|1.207075|108.3898447|0.0026008|-0.0037181|33.6296919 unknown
InChI: InChI=1S/C6H4Br2O/c7-4-2-1-3-5(8)6(4)9/h1-3,9H
charge 0 multiplicity 1
13 atoms
Br 2.890406 1.006964 -0.000034
Br -2.926395 0.982659 -0.000067
O  0.032491 2.130999 -0.000311
C  -0.014353 0.742859 -0.00012
C  1.209275 0.022292 -0.000014
C  -1.22552 -0.003466 -0.00002
C  1.22066 -1.386623 0.000104
C  -1.231206 -1.411006 0.000109
C  0.001076 -2.103316 0.000152
H  2.176028 -1.919396 0.000141
H  -2.178209 -1.958294 0.000152
H  0.010938 -3.197159 0.000215
H  -0.886192 2.509988 -0.000308
