program: Gaussian 09
title: 000135549
version: EM64L-G09RevD.01
frameworkgroup: C1[X(C12H24N2O3)]
method: RPBEPBE
basis: SDD
operation: Freq
keyword: #p
keyword: freq=noraman
keyword: PBEPBE/SDD
title: #p freq=noraman PBEPBE/SDD
converged: YES YES NO NO
title: Mulliken charges:
elementType: O O O N N C C C C C C C C C C C C H H H H H H H H H H H H H H H H H H H H H H H H
charge: -0.318802 -0.331521 -0.378707 -0.365707 -0.305966 -0.384457 -0.380857 -0.368545 -0.372521 -0.373540 -0.353579 -0.537933 -0.356297 -0.696157 0.287631 -0.471662 0.271464 0.194773 0.198519 0.191756 0.193320 0.193676 0.192175 0.190025 0.191185 0.241745 0.203397 0.188364 0.187570 0.210355 0.237950 0.195585 0.194792 0.215861 0.210042 0.209398 0.316986 0.264660 0.248071 0.393790 0.373158
chargesum: 0.00000
title: Mulliken charges with hydrogens summed into heavy atoms:
elementType: O O O N N C C C C C C C C C C C C
charge: -0.318802 -0.331521 -0.005549 -0.048720 0.087824 0.008835 0.004220 0.017305 0.008689 0.071603 0.022355 -0.089628 0.034080 -0.060855 0.287631 0.041070 0.271464
polarizability: 2.14492571e+02 3.39336844e+00 1.41929723e+02 3.70358537e+00 2.08185588e+00 1.20487745e+02
1716.lowfreq: -24.1908 -4.5973 -4.2820 -0.0008 0.0009 0.0010 4.3319 20.9977 27.4614
frequency: -13.4877 20.9620 27.1379 29.1683 52.7594 62.1356 70.6605 86.3591 95.4392 111.6961 129.2858 134.4297 143.5087 168.0360 169.9798 206.3060 233.4864 237.2504 257.9481 297.9325 326.4557 348.9001 378.8265 429.7649 461.1352 475.3797 487.8728 545.7547 578.5320 621.9297 681.0553 720.7113 724.3427 726.4843 736.2362 760.3071 772.5149 816.5204 849.7305 881.0250 887.9030 913.3967 947.4027 960.1169 990.0317 992.2015 1011.7068 1028.4601 1038.8324 1048.8257 1063.6219 1071.4369 1080.1131 1081.7421 1114.3539 1120.5505 1183.9232 1204.3078 1210.8758 1220.8702 1238.1086 1246.4320 1258.0382 1262.3847 1274.9788 1279.9717 1283.8422 1291.7420 1295.0219 1299.5263 1318.8854 1331.9027 1341.3567 1350.1625 1354.4675 1355.9211 1358.8763 1388.5556 1433.2525 1447.2178 1460.3476 1460.6497 1464.2471 1467.6971 1474.1513 1477.9433 1479.6496 1480.5992 1485.8377 1488.9886 1495.2979 1572.3905 1599.9222 2949.5108 2950.3260 2951.4119 2955.6051 2962.2898 2967.5987 2971.4224 2975.2952 2982.4577 2983.8639 2989.7164 2998.0402 3011.5079 3021.5339 3025.6879 3031.1832 3040.0533 3061.8739 3068.1152 3070.3271 3115.7798 3273.6973 3374.5609 3560.6399
redmass: 4.0010 4.6705 3.4568 2.0278 5.1867 1.9286 5.1381 3.2178 2.6618 2.2547 4.6423 2.0971 2.0299 4.1087 6.3533 4.5201 4.4284 1.1249 3.4144 4.5138 4.0572 3.9942 3.1404 2.8628 1.8828 2.9774 1.7313 1.3516 2.4243 3.7806 4.6442 1.0598 1.0931 1.4538 1.1123 1.5058 1.7123 1.2843 2.9074 1.2937 1.9078 4.2213 1.3567 2.9161 4.3169 4.7263 1.1676 3.6320 3.5100 2.9583 2.6900 2.4609 2.1500 2.2831 1.6682 2.6726 1.8238 1.4066 1.4014 1.4698 1.5328 1.3163 1.3866 1.3174 1.2130 1.0536 1.1700 1.1410 1.1252 1.2038 1.4030 1.2851 1.4362 1.5777 1.6399 1.6255 1.6947 1.2168 1.1413 1.1068 1.0717 1.0724 1.0655 1.0798 1.0818 1.0430 1.7709 1.1484 1.0910 1.0919 1.8335 6.5351 4.6871 1.0585 1.0586 1.0589 1.0593 1.0590 1.0587 1.0363 1.0601 1.0767 1.0844 1.0950 1.0994 1.1026 1.0633 1.1024 1.1019 1.1047 1.1035 1.1007 1.0993 1.1004 1.0639 1.0890 1.0787
irintensity: 0.8320 0.2508 0.2441 0.6133 1.7420 0.3494 1.9452 0.5294 1.2383 0.2608 10.4625 0.1375 0.0312 4.1070 0.7253 0.7342 19.9250 0.7163 9.6768 2.3097 6.3247 23.3671 1.5422 7.6712 38.9387 0.2701 86.6062 64.1617 66.1759 12.5302 4.6691 16.1095 6.2180 152.7342 12.3064 15.8647 18.7124 3.5528 6.0457 1.2948 6.0746 63.4722 1.1269 12.6348 0.2064 4.1011 0.8944 52.5557 14.2376 3.7413 1.0687 4.0368 0.2267 0.6736 4.4910 14.9100 1.5371 3.1194 17.7935 2.5913 46.4404 4.3719 30.8579 35.6749 0.8016 0.1698 8.3058 5.6032 0.3123 2.3123 17.3478 2.3611 6.3325 4.5769 0.4638 0.9829 160.7802 11.1709 23.2028 7.3462 0.0676 0.2529 0.3582 0.3138 1.9813 11.5270 134.8248 13.3442 7.0490 32.4403 53.0237 137.0892 211.6353 0.6641 0.0796 5.5194 0.3814 42.7075 156.5385 37.9993 3.3139 30.1937 23.9317 5.7604 3.0640 4.1532 15.8789 1.8921 10.5678 130.2422 77.2094 99.5211 54.5991 3.5322 10.9592 318.7094 26.7450
temp: 298.150 k
press: 1.00000 atm
elementType: 8 8 8 7 7 6 6 6 6 6 6 6 6 6 6 6 6 1 1 1 1 1 1 1 1 1 1 1 1 1 1 1 1 1 1 1 1 1 1 1 1
symmnumber: 1
zpe: 927940.3 jmol-1
zpe.correction: 0.353434 hartree
zpe.thermalcorrener: 0.373679 hartree
zpe.thermalcorrenthalpy: 0.374624 hartree
zpe.thermalcorrgfe: 0.301391 hartree
zpe.sumelectzpe: -805.446819 hartree
zpe.sumelectthermal: -805.426573 hartree
zpe.sumelectthermalent: -805.425629 hartree
zpe.sumelectthermalfe: -805.498861 hartree
dipole: 4.2480 -3.4969 -0.4343
dipole: 5.5192
quadrupole: -141.5474 -104.3188 -105.4464
quadrupole: 10.0831 -2.7504 -1.2511
quadrupole: -24.4432 12.7854 11.6578 10.0831 -2.7504 -1.2511
hfenergy: -805.8002525 hartree
pointgroup: C01 [X(C12H24N2O3)]
dipole: 1.6934228 -1.2560233 -0.5194967 debye
polarizability: 214.3991074|3.7137804|139.6168879|4.1386123|7.1727969|122.8940441 unknown
InChI: InChI=1S/C12H24N2O3/c1-2-3-4-5-6-7-8-9-11(15)13-10-12(16)14-17/h13-14,17H,2-10H2,1H3
charge 0 multiplicity 1
41 atoms
O  -2.663949 0.479082 0.964197
O  -6.794883 -0.550344 -0.528268
O  -6.253535 1.983991 0.198505
N  -3.382812 -1.308779 -0.318721
N  -5.354746 0.90757 0.513457
C  2.665337 -0.184345 0.308153
C  3.990552 0.048488 -0.451881
C  1.424185 -0.175795 -0.612638
C  5.231047 0.042538 0.469888
C  0.103173 -0.367931 0.163261
C  6.556243 0.292064 -0.284984
C  -1.136584 -0.363913 -0.766698
C  7.795779 0.288749 0.638896
C  9.115369 0.54303 -0.121442
C  -2.440343 -0.359417 0.024705
C  -4.658012 -1.439481 0.413798
C  -5.684618 -0.343391 0.081131
H  2.716846 -1.153109 0.847686
H  2.547232 0.598282 1.086126
H  4.110175 -0.732063 -1.232411
H  3.938535 1.018849 -0.98873
H  1.385974 0.786249 -1.165525
H  1.531084 -0.972226 -1.378968
H  5.289405 -0.930979 1.000551
H  5.106328 0.816829 1.255706
H  -0.021127 0.440167 0.908282
H  0.137475 -1.320372 0.729553
H  6.498997 1.265776 -0.815419
H  6.684493 -0.48187 -1.070772
H  -1.096815 -1.220835 -1.467155
H  -1.116358 0.560158 -1.378147
H  7.665117 1.06044 1.424972
H  7.853468 -0.685088 1.166977
H  9.985239 0.535816 0.560959
H  9.095208 1.524005 -0.632945
H  9.284104 -0.232522 -0.892452
H  -3.212303 -1.917742 -1.120231
H  -4.440516 -1.423867 1.497251
H  -5.122592 -2.402263 0.151788
H  -4.439342 1.180435 0.907962
H  -7.005929 1.483511 -0.255316
