program: Gaussian 09
title: 000135624
version: EM64L-G09RevD.01
frameworkgroup: C1[X(C22H18O8)]
method: RPBEPBE
basis: SDD
operation: Freq
keyword: #pfreq=noraman
keyword: PBEPBE/SDD
title: #p freq=noraman PBEPBE/SDD
converged: YES YES NO NO
title: Mulliken charges:
elementType: O O O O O O O O C C C C C C C C C C C C C C C C C C C C C C H H H H H H H H H H H H H H H H H H
charge: -0.286515 -0.263809 -0.391106 -0.211721 -0.345671 -0.329496 -0.292713 -0.388572 0.423979 -0.236852 -0.451101 -0.600604 -0.510483 0.225014 0.200456 0.251040 -0.688895 -0.141424 -0.078043 0.111746 0.209120 -0.100380 -0.018497 0.380488 -0.001455 -0.501904 0.134558 -0.424586 -0.352624 -0.192104 0.247391 0.310155 0.294844 0.204151 0.219964 0.244011 0.218107 0.225943 0.229584 0.394879 0.371186 0.245066 0.233087 0.247440 0.294010 0.263703 0.241023 0.387610
chargesum: 0.00000
title: Mulliken charges with hydrogens summed into heavy atoms:
elementType: O O O O O O O O C C C C C C C C C C C C C C C C C C C C C C
charge: -0.286515 -0.263809 0.003773 -0.211721 0.025515 -0.329496 -0.292713 -0.000962 0.423979 0.010539 -0.140946 -0.101609 -0.046508 0.225014 0.200456 0.251040 -0.015261 -0.141424 -0.078043 0.111746 0.209120 -0.100380 -0.018497 0.380488 -0.001455 0.223689 0.134558 -0.130576 -0.088922 0.048919
polarizability: 4.69423178e+02 1.97100340e+01 2.81130247e+02 3.54420089e+00 -2.12109125e+01 1.56716418e+02
1716.lowfreq: -13.7613 -5.0749 -0.0009 -0.0008 -0.0004 2.4129 5.9674 28.1682 40.1906
frequency: -11.7620 28.1261 40.1816 49.3254 68.0642 74.2936 80.8378 101.5884 107.5630 120.9044 132.2977 147.5599 156.5470 175.5719 185.5002 191.2933 215.6211 220.0305 234.4274 256.8513 262.7913 264.9850 287.2678 319.0167 333.0582 336.2661 354.0830 371.6001 397.1998 407.4604 434.6741 440.9707 444.4641 450.0347 456.6817 465.6065 482.2584 488.6057 514.5490 527.6860 544.7321 551.8755 591.0164 604.4066 629.8650 641.6049 672.0372 683.3606 701.4839 709.9044 734.0275 750.3951 756.8726 760.0689 784.9378 802.1076 828.4943 841.2543 844.1211 875.8909 880.7780 913.1765 928.5158 934.2060 952.2929 975.2233 984.8178 994.5575 995.9322 996.8687 1021.8818 1023.2767 1047.7629 1058.9194 1063.0678 1098.7152 1113.8817 1118.6129 1128.9174 1132.1881 1151.4174 1172.3569 1182.3907 1197.0581 1216.5898 1225.1949 1232.7576 1263.7355 1267.8422 1277.1921 1283.5359 1298.0304 1309.6145 1314.1081 1322.5302 1331.8206 1336.9289 1365.3983 1398.8747 1404.9249 1412.7667 1419.4045 1421.5870 1424.8165 1436.2386 1451.5807 1451.8819 1453.3179 1458.6247 1463.2844 1472.8631 1481.2860 1487.3109 1543.5743 1550.8723 1576.7820 1596.7227 1609.6423 1624.1416 1653.6404 2450.0911 2623.7827 2953.6850 2982.2567 2999.2184 3004.6076 3007.6545 3040.5473 3050.6681 3079.0686 3084.3570 3092.6001 3112.3522 3146.9346 3152.0967 3171.8242 3180.7402 3542.9827
redmass: 4.5020 6.8435 4.9450 5.1515 4.1179 5.8803 3.2960 2.7583 1.3605 5.7098 4.5768 3.3750 5.6192 5.7843 2.8690 4.5029 4.7749 2.0313 4.6280 3.7467 4.1362 4.1457 2.0108 5.8765 5.9931 5.1963 2.8134 2.2408 6.5133 8.3487 8.2642 7.0672 6.1995 6.7110 6.5569 6.8639 6.1418 6.5609 4.8191 5.6454 7.5109 6.1724 6.5483 5.8266 6.2091 5.6768 5.3396 5.6282 6.9845 5.2536 4.5109 5.0612 6.3825 7.9003 1.3195 2.3940 4.4455 3.5459 4.9660 4.8261 4.7272 4.0358 1.4369 3.4006 3.8650 2.7085 1.0642 2.9658 4.2749 1.3602 1.8715 1.3335 1.4791 2.0846 2.4091 3.5382 1.2851 2.3107 2.6553 3.2484 1.4534 1.3841 1.4632 1.7323 1.5432 1.6516 1.3527 2.2294 1.6507 2.3297 2.5132 2.7982 1.9148 2.2165 1.6755 3.9057 2.1238 8.2197 1.2276 4.3079 4.3524 4.9012 1.1950 2.0795 1.6352 2.8701 3.2354 1.0506 5.4824 1.0518 1.0715 1.0453 1.0760 3.4700 5.2637 4.0962 3.4406 4.8209 6.0739 9.5874 1.0774 1.0717 1.0588 1.0362 1.0603 1.0996 1.0293 1.0825 1.1009 1.1011 1.0992 1.0907 1.1049 1.0879 1.1051 1.0923 1.0986 1.0650
irintensity: 0.6615 0.3058 2.5666 2.3773 0.5894 1.3012 0.3458 0.8878 0.0261 0.1473 0.8938 1.8592 1.3688 0.8763 0.6532 1.1335 0.7630 2.5359 3.2916 5.7214 0.8377 2.7819 53.0719 5.1308 14.8994 7.2306 12.1358 47.8887 3.6762 1.9304 9.6204 33.5115 20.1529 2.5672 30.6222 9.9863 2.8986 8.6194 1.0890 0.9764 1.5645 1.6600 6.0245 2.4082 4.7191 2.3223 0.6472 2.9116 3.8563 17.3635 8.7461 8.4898 18.2200 7.4777 9.8632 39.9320 1.6319 24.3106 9.3874 9.0501 6.0916 37.2850 0.0051 60.8829 49.4476 15.0364 116.8207 20.6951 13.3649 0.9981 50.3957 81.0910 1.5837 21.1538 5.9430 26.0296 8.2814 107.8093 78.9512 268.9349 21.2271 88.9532 42.1445 24.9914 17.9184 16.5434 3.0438 94.7464 60.4478 388.2128 29.5789 40.2402 55.2706 53.3263 34.0357 414.4464 120.4501 51.9652 11.8618 26.5830 272.3710 9.4323 13.6386 6.1590 32.7118 136.8000 29.7084 15.3294 330.5843 9.3905 6.1370 13.5740 20.7127 4.5323 38.9746 63.9894 54.9821 22.6133 18.1706 145.2225 189.6071 220.7266 16.9796 21.2437 19.7054 5.1029 37.2454 3.2972 0.2100 37.1184 49.2739 41.0147 19.4947 13.0589 15.9267 0.7671 14.0336 69.6268
temp: 298.150 k
press: 1.00000 atm
elementType: 8 8 8 8 8 8 8 8 6 6 6 6 6 6 6 6 6 6 6 6 6 6 6 6 6 6 6 6 6 6 1 1 1 1 1 1 1 1 1 1 1 1 1 1 1 1 1 1
symmnumber: 1
zpe: 930192.2 jmol-1
zpe.correction: 0.354292 hartree
zpe.thermalcorrener: 0.379600 hartree
zpe.thermalcorrenthalpy: 0.380545 hartree
zpe.thermalcorrgfe: 0.299956 hartree
zpe.sumelectzpe: -1448.807509 hartree
zpe.sumelectthermal: -1448.782200 hartree
zpe.sumelectthermalent: -1448.781256 hartree
zpe.sumelectthermalfe: -1448.861844 hartree
dipole: 3.6686 0.1523 2.3081
dipole: 4.3370
quadrupole: -161.9766 -166.2512 -172.9024
quadrupole: 15.1692 1.2997 5.2397
quadrupole: 5.0668 0.7922 -5.8590 15.1692 1.2997 5.2397
hfenergy: -1449.1618003 hartree
pointgroup: C01 [X(C22H18O8)]
dipole: -1.4405287 0.0573188 -0.9127206 debye
polarizability: 469.8730168|-17.4196846|279.8647857|4.1568996|23.3615781|157.5320411 unknown
InChI: InChI=1S/C22H18O8/c1-3-22-11(30-22)7-9-13(16(22)21(28)29-2)20(27)14-15(18(9)25)19(26)12-8(17(14)24)5-4-6-10(12)23/h4-6,11,16,23,25,27H,3,7H2,1-2H3
charge 0 multiplicity 1
48 atoms
O  -4.601928 1.336411 0.466148
O  -4.516817 -1.801021 0.883532
O  -0.77951 -2.187415 -0.623712
O  -2.799466 -0.919177 2.188788
O  0.507581 3.094955 0.662906
O  1.627322 -2.748326 -0.688886
O  3.070778 2.450925 0.538672
O  5.495654 1.837862 0.486653
C  -3.922858 0.623962 -0.698674
C  -3.584304 2.052694 -0.38793
C  -2.910309 -0.449737 -0.263772
C  -2.27365 2.426014 0.296099
C  -4.847849 0.278893 -1.855848
C  -1.484327 0.053386 -0.160609
C  -1.171456 1.385146 0.135882
C  -3.357347 -1.059649 1.0832
C  -4.100367 0.170888 -3.206043
C  -0.430847 -0.894898 -0.33122
C  0.201995 1.784299 0.30761
C  0.936094 -0.499027 -0.20576
C  1.267838 0.864099 0.12307
C  1.967055 -1.520806 -0.401563
C  2.691427 1.240297 0.256468
C  3.384908 -1.148102 -0.267395
C  3.72004 0.203652 0.054872
C  -5.12058 -2.385481 2.10681
C  5.10807 0.56036 0.182289
C  4.39153 -2.118407 -0.455947
C  6.11365 -0.427399 -0.00974
C  5.752994 -1.749178 -0.324842
H  -4.03397 2.832466 -1.016889
H  -2.936669 -1.280633 -0.990335
H  -2.486726 2.591174 1.37267
H  -1.946431 3.397318 -0.128744
H  -5.631107 1.05741 -1.916795
H  -5.358174 -0.675082 -1.62393
H  -3.617358 1.127406 -3.478352
H  -3.315989 -0.607757 -3.180099
H  -4.803341 -0.095526 -4.014835
H  0.130615 -2.721346 -0.714724
H  -0.313867 3.618863 0.845539
H  -4.406603 -3.073007 2.589913
H  -6.011328 -2.921481 1.751298
H  -5.392185 -1.58258 2.811956
H  4.094776 -3.141881 -0.700193
H  7.159318 -0.124324 0.09519
H  6.536656 -2.499967 -0.470241
H  4.61426 2.394024 0.582311
