program: Gaussian 09
title: 000135534
version: EM64L-G09RevD.01
frameworkgroup: C1[X(C7H14N2O3)]
method: RPBEPBE
basis: SDD
operation: Freq
keyword: #p
keyword: freq=noraman
keyword: PBEPBE/SDD
title: #p freq=noraman PBEPBE/SDD
converged: YES YES NO NO
title: Mulliken charges:
elementType: O O O N N C C C C C C C H H H H H H H H H H H H H H
charge: -0.300165 -0.280744 -0.279282 -0.065490 0.055331 0.386011 0.040599 -0.442359 -0.378446 -0.752572 -0.719717 -0.532354 0.236506 0.279590 0.233951 0.217041 0.243317 0.241769 0.234649 0.227245 0.235899 0.211827 0.223437 0.236866 0.218547 0.228544
chargesum: 0.00000
title: Mulliken charges with hydrogens summed into heavy atoms:
elementType: O O O N N C C C C C C C
charge: -0.300165 -0.280744 -0.279282 -0.065490 0.055331 0.386011 0.277105 0.071182 0.081912 -0.048909 -0.048555 0.151604
polarizability: 1.11058490e+02 -6.36327490e+00 1.08009856e+02 6.05255089e+00 3.23717003e-01 8.62865107e+01
1716.lowfreq: -8.6746 -0.0008 -0.0003 0.0004 5.3452 12.0260 55.4008 94.9029 101.4359
frequency: 55.3899 94.9000 101.4286 143.0712 175.3831 197.1705 212.4257 225.5238 245.2911 270.3079 293.7783 326.3021 329.3044 354.8220 395.7276 420.9428 436.4390 481.0848 550.8726 596.6900 692.2883 733.8051 762.6754 825.0958 850.9787 907.0478 914.6042 934.4690 949.1569 998.1715 1012.8525 1063.5014 1110.1063 1116.4003 1134.3272 1144.2195 1150.2333 1162.0508 1199.0625 1226.5772 1260.9960 1288.3015 1318.2196 1323.5942 1337.6880 1351.7817 1369.2390 1386.1134 1393.4120 1426.0614 1441.2570 1446.3865 1457.9397 1462.0015 1464.3039 1475.9815 1478.6245 1487.5444 2965.1238 2973.4579 2992.8040 2999.4085 3002.2252 3005.5688 3055.0632 3078.1629 3080.5385 3091.2503 3100.1404 3107.7075 3109.2396 3112.4635
redmass: 6.1298 3.4968 2.9655 2.1133 1.1264 1.2988 2.0851 1.5824 2.5563 2.1710 2.6973 5.1002 3.2804 5.0112 2.6580 5.4806 3.0105 2.7010 4.5598 3.5694 5.5917 3.8261 3.5130 3.6149 3.2944 1.8731 1.7670 1.9996 2.1876 5.1603 2.3840 1.8817 1.7834 1.6009 1.8748 2.2095 1.5674 2.7478 1.8031 2.2440 3.1126 1.3686 1.5806 1.4326 2.1393 1.8310 1.8919 1.2493 1.2522 1.1310 1.0792 1.0853 1.0552 1.0506 1.0535 1.0525 1.0496 1.0490 1.0317 1.0663 1.0362 1.0621 1.0803 1.0385 1.1031 1.0976 1.0983 1.0992 1.0997 1.0996 1.1005 1.1005
irintensity: 2.0964 1.5069 2.0378 5.6054 2.2032 1.6823 3.2892 5.3428 3.1014 1.5807 8.4987 6.9400 0.3310 1.5688 0.6034 5.2354 1.6386 6.7426 3.2198 6.3323 2.7988 35.1902 15.6063 26.8207 24.6240 8.5773 11.8685 23.2714 98.3869 117.9253 68.0375 111.3377 13.8999 5.6258 3.5547 23.3784 31.8747 43.6107 46.6086 64.3562 15.1921 26.7862 30.1697 36.8650 24.0798 29.2530 67.9353 34.7559 20.5691 5.6438 9.9652 6.1319 6.5227 11.2034 16.3487 3.7078 16.8437 4.0569 59.6440 25.2708 24.7200 6.4112 34.7687 21.6816 44.4430 3.6520 5.5892 32.8661 24.7090 30.8027 9.2128 17.9908
temp: 298.150 k
press: 1.00000 atm
elementType: 8 8 8 7 7 6 6 6 6 6 6 6 1 1 1 1 1 1 1 1 1 1 1 1 1 1
symmnumber: 1
zpe: 560074.1 jmol-1
zpe.correction: 0.213321 hartree
zpe.thermalcorrener: 0.226355 hartree
zpe.thermalcorrenthalpy: 0.227300 hartree
zpe.thermalcorrgfe: 0.174758 hartree
zpe.sumelectzpe: -609.266440 hartree
zpe.sumelectthermal: -609.253406 hartree
zpe.sumelectthermalent: -609.252462 hartree
zpe.sumelectthermalfe: -609.305003 hartree
dipole: -4.5642 1.8365 -1.2853
dipole: 5.0849
quadrupole: -85.1581 -67.5174 -68.9646
quadrupole: 8.3206 -7.4593 3.2749
quadrupole: -11.2781 6.3627 4.9154 8.3206 -7.4593 3.2749
hfenergy: -609.4797613 hartree
pointgroup: C01 [X(C7H14N2O3)]
dipole: -1.6917829 0.8505119 -0.6455408 debye
dipolederiv: -0.577375 -0.0793039 -0.0047249 -0.213255 -1.1412429 -0.0313904 0.0459221 -0.1585401 -0.50884 -0.6973439 -0.120563 0.2569024 -0.1436775 -0.6084221 0.0548725 0.3856769 0.2314129 -0.8084289 -0.5515594 0.1304415 -0.166539 0.8895993 -0.8230007 0.3877094 -0.0826565 -0.0237838 -0.253929 -0.7855709 0.4330739 -0.2298833 0.1133853 -0.26782 0.0192345 -0.2597428 0.2663637 -0.3577535 0.8587215 -0.5526405 0.5003298 -0.9587003 0.4994464 -0.437424 0.5276043 -0.3014676 0.210413 0.6820124 -0.0498575 -0.0241579 0.2385727 1.166154 -0.1142973 -0.3480821 -0.2113947 0.8641042 0.5075606 0.1655406 0.031632 0.1167251 0.5274296 0.104267 0.0123364 0.2463788 0.3383571 -0.0962697 0.1076929 -0.0393896 0.1670656 -0.0446048 0.0792914 -0.0769402 0.0776117 0.2018384 0.0149908 -0.0817127 -0.0589731 -0.0997673 0.3537336 -0.1098009 -0.0707695 -0.1191837 0.2156809 -0.1139055 -0.0778784 -0.1284546 -0.0751111 -0.0851285 -0.0556851 -0.0182992 -0.058225 -0.1338002 -0.0408918 0.0916538 -0.0035531 0.026897 -0.101941 -0.005079 0.0027099 -0.0187316 0.0759311 0.5184195 0.1668352 -0.2319703 0.0523698 0.3023894 0.0321703 -0.1218075 -0.0297548 0.3031233 -0.0066124 -0.0302149 0.0037614 -0.0071938 0.0076726 0.0666711 0.0102171 -0.0175634 -0.1331234 0.1423791 0.0739101 0.0056381 -0.0407776 0.0073082 -0.0175833 -0.0004417 0.0391397 0.1149069 0.0211929 -0.0283771 0.0017441 -0.0743967 0.0904019 0.0338285 -0.0058491 -0.0071333 -0.1344501 0.0620142 0.0438886 0.0018677 0.0555275 -0.0283571 0.0573745 0.0419779 0.1235829 -0.1124448 0.0410368 -0.1051688 -0.0544145 -0.0205546 0.0312586 -0.0324977 -0.0541345 -0.0902484 0.0428608 -0.1232778 0.0014435 0.0207996 0.0311364 0.0935209 -0.0197231 0.056387 -0.0128741 0.093691 0.1067271 -0.0182462 0.0591568 -0.0129773 0.0804613 0.0771194 0.0413974 0.0474578 -0.0957383 0.0815384 0.0518003 -0.0095831 0.0204259 -0.1167351 -0.0146895 -0.022304 0.0130396 0.0943409 -0.1312811 0.0568033 0.0559137 0.0016755 0.0858516 0.0118088 0.0528883 0.0158717 0.0856224 0.0457306 -0.0992962 -0.0804933 -0.0571341 -0.0433607 -0.0719705 -0.0706066 -0.0963466 0.0232997 0.0950226 -0.0027763 0.0483939 0.0074973 0.0673942 0.0195735 0.0155585 0.100035 -0.1181378 0.0629485 -0.0067536 -0.0245839 -0.0101069 0.1065148 0.0187762 0.0349667 0.040081 -0.1398594 -0.0930818 -0.1235779 0.0306556 -0.1289914 -0.0751591 -0.053661 -0.0599692 -0.0945851 0.0491206 -0.0231257 0.053283 0.0399257 0.1217663 -0.0837652 0.0011048 -0.0360398 0.0388574 0.0832151 unknown
polarizability: 109.0642005|-6.2881104|109.024569|7.7832069|-1.219471|87.2660865 unknown
InChI: InChI=1S/C7H14N2O3/c1-6-4-9(8-10)5-7(2,11-3)12-6/h6H,4-5H2,1-3H3
charge 0 multiplicity 1
26 atoms
O  -1.284081 0.680836 -0.617117
O  -0.994236 -1.198761 0.880158
O  2.897642 -1.397484 0.685523
N  1.439948 0.119727 -0.122483
N  2.5551 -0.158521 0.65359
C  -0.866351 -0.733324 -0.502028
C  -0.489426 1.609593 0.237059
C  0.641031 -0.898765 -0.821057
C  0.997288 1.517413 -0.169188
C  -1.751393 -1.49343 -1.492154
C  -1.080214 2.999836 0.015306
C  -2.35661 -1.171787 1.434372
H  -0.593248 1.288474 1.292659
H  1.002062 -1.885679 -0.48449
H  0.78951 -0.807473 -1.91371
H  1.115761 1.918597 -1.196281
H  1.639062 2.09198 0.520299
H  -2.81726 -1.334673 -1.259973
H  -1.573939 -1.127963 -2.517195
H  -1.53002 -2.573678 -1.450078
H  -2.15041 3.005947 0.282705
H  -0.560887 3.748869 0.640138
H  -0.990046 3.298002 -1.044284
H  -2.228976 -1.297945 2.520677
H  -2.969504 -2.005107 1.040379
H  -2.859103 -0.209284 1.220871
