program: Gaussian 09
title: 000135506
version: EM64L-G09RevD.01
frameworkgroup: C1[X(C22H14O)]
method: RPBEPBE
basis: SDD
operation: Freq
keyword: #pfreq=noraman
keyword: PBEPBE/SDD
title: #p freq=noraman PBEPBE/SDD
converged: NO YES NO YES
title: Mulliken charges:
elementType: O C C C C C C C C C C C C C C C C C C C C C C H H H H H H H H H H H H H H
charge: -0.432590 0.225911 0.245072 0.499154 0.492226 0.223548 0.192519 -0.667102 -0.684706 0.440998 0.417799 -0.513282 -0.507617 -0.485186 -0.479606 -0.508266 -0.367028 -0.419859 -0.434866 0.282317 -0.420001 -0.260060 -0.250382 0.235221 0.232337 0.241172 0.242964 0.236165 0.234532 0.249587 0.224260 0.239553 0.239526 0.222364 0.227401 0.229089 0.356833
chargesum: 0.00000
title: Mulliken charges with hydrogens summed into heavy atoms:
elementType: O C C C C C C C C C C C C C C C C C C C C C C
charge: -0.075758 0.225911 0.245072 0.499154 0.492226 0.223548 0.192519 -0.431881 -0.452369 0.440998 0.417799 -0.272110 -0.264653 -0.249020 -0.245074 -0.258679 -0.142767 -0.180307 -0.195339 0.282317 -0.197637 -0.032658 -0.021292
polarizability: 5.28929463e+02 1.32480107e+00 2.60499566e+02 -1.48614443e-03 8.05370850e-03 8.94093271e+01
1716.lowfreq: -6.6542 -4.3130 -0.0012 -0.0007 0.0000 10.8689 34.6503 56.7461 103.6123
frequency: 34.6398 56.7441 103.6119 110.3585 122.5139 173.4837 187.7009 200.2990 252.2890 294.9400 316.2275 330.7594 348.1149 353.9757 402.7291 422.7059 430.5613 430.9537 441.7144 469.1650 492.5878 502.6148 527.2838 535.0206 539.6108 575.0124 595.6478 626.1875 648.0992 681.2105 694.6562 720.6454 730.0241 742.0724 754.2623 756.7974 781.0170 797.9957 811.5118 826.6555 827.9425 836.4067 871.9060 880.5216 883.9174 885.9312 909.3610 928.4449 940.3557 956.4661 957.2347 979.2811 982.5180 991.3481 1024.4916 1040.9894 1100.6391 1111.8109 1152.5617 1156.3363 1159.9418 1177.5627 1204.4568 1213.6335 1225.0496 1231.7560 1233.6943 1239.2695 1271.3906 1289.9208 1300.1346 1315.3925 1359.1977 1389.4036 1400.3682 1408.6485 1412.2402 1441.0590 1447.4734 1450.3033 1457.2682 1474.4618 1502.4513 1519.7306 1558.4291 1567.7476 1605.2483 1617.0309 1624.2588 1628.8996 1638.8467 3113.7921 3116.1438 3116.3925 3120.3884 3129.7754 3133.2797 3135.7765 3139.6980 3141.7945 3142.5269 3149.7111 3164.4419 3173.6553 3583.7617
redmass: 5.7751 4.6057 4.3161 5.8846 4.9544 4.2036 6.4967 4.6248 4.1761 6.4893 4.1279 4.9364 1.0991 5.4071 3.0217 6.0238 5.4591 2.9060 2.9788 5.5428 6.1846 5.0230 2.9872 3.0642 6.3772 3.0626 4.2475 7.3154 6.6532 3.1350 6.4862 6.1998 2.5933 5.7169 5.8768 1.2908 1.4950 1.7308 2.2252 6.2365 1.6729 1.6297 4.2855 4.4601 1.7851 1.6874 1.6100 1.9296 1.4621 1.4094 4.8153 1.4137 1.4091 1.3801 2.9804 2.1136 2.2179 2.0498 1.3243 1.3546 1.2609 1.0819 1.6543 1.7540 1.7583 1.8371 2.0763 2.1561 1.6660 1.5296 1.9831 2.6065 3.7272 4.2153 6.8858 3.6460 2.0849 3.1806 3.8284 3.2465 3.3183 3.3299 3.5893 3.9378 5.5326 7.9095 5.8054 6.5333 6.5423 6.7142 6.6782 1.0874 1.0860 1.0861 1.0864 1.0894 1.0897 1.0911 1.0976 1.0979 1.0973 1.0929 1.0997 1.0901 1.0661
irintensity: 0.3187 1.4374 0.1314 0.8558 0.7321 1.6942 0.2197 2.5264 2.5332 2.9095 1.6874 1.2210 139.6294 2.0525 0.0236 0.0757 12.9218 12.8627 0.9027 2.4059 2.8934 5.6353 0.3229 17.1093 0.0014 0.5103 17.4242 0.2778 15.2410 3.4922 8.2491 2.5627 0.2035 0.6476 3.8016 53.7308 2.4547 0.0274 8.2424 13.5095 78.1294 18.0753 3.9432 14.9265 8.8576 0.1044 87.4936 1.6448 7.0490 8.2354 39.5720 0.0932 0.0098 0.0194 1.5061 9.0034 19.4996 29.7607 233.5380 0.2872 34.9516 1.2102 2.5408 0.4773 0.5572 17.9838 16.8412 3.4367 1.6759 35.6211 15.7883 15.3628 3.5141 6.5616 0.3874 12.1673 2.4553 10.7847 15.9333 29.6077 0.4698 0.0580 9.0485 78.7429 11.4925 10.2630 6.4604 10.4919 22.3435 9.4109 91.4089 12.7367 0.0535 0.8835 4.0158 11.6607 2.7586 1.7138 16.5218 58.0561 17.7623 38.2316 43.4272 5.1724 69.2088
temp: 298.150 k
press: 1.00000 atm
elementType: 8 6 6 6 6 6 6 6 6 6 6 6 6 6 6 6 6 6 6 6 6 6 6 1 1 1 1 1 1 1 1 1 1 1 1 1 1
symmnumber: 1
zpe: 753451.6 jmol-1
zpe.correction: 0.286975 hartree
zpe.thermalcorrener: 0.303316 hartree
zpe.thermalcorrenthalpy: 0.304261 hartree
zpe.thermalcorrgfe: 0.243486 hartree
zpe.sumelectzpe: -920.497516 hartree
zpe.sumelectthermal: -920.481174 hartree
zpe.sumelectthermalent: -920.480230 hartree
zpe.sumelectthermalfe: -920.541005 hartree
dipole: 1.5515 0.8479 0.0000
dipole: 1.7681
quadrupole: -93.3857 -118.0895 -142.6766
quadrupole: 1.9372 -0.0003 0.0017
quadrupole: 24.6649 -0.0389 -24.6260 1.9372 -0.0003 0.0017
hfenergy: -920.7844904 hartree
pointgroup: C01 [X(C22H14O1)]
dipole: -0.614276 -0.326412 0.0000056 debye
polarizability: 528.9236685|-1.8194794|260.5053602|0.0013917|-0.0080706|89.4093271 unknown
InChI: InChI=1S/C22H14O/c23-18-10-9-15-6-8-17-11-20-16(12-21(17)22(15)13-18)7-5-14-3-1-2-4-19(14)20/h1-13,23H
charge 0 multiplicity 1
37 atoms
O  -5.439343 2.486787 0.00013
C  -1.200104 -0.027503 0.000057
C  1.694694 -0.207785 0.000078
C  -0.527586 -1.313906 0.000089
C  1.020983 1.077505 0.000001
C  -2.670206 0.013365 0.000077
C  3.164095 -0.246222 0.000116
C  -0.395076 1.133107 -0.000005
C  0.88869 -1.368822 0.000102
C  -3.403587 -1.23043 0.00009
C  3.899332 0.995083 0.000006
C  -1.311696 -2.531954 0.000103
C  1.805451 2.294913 -0.000096
C  -2.690643 -2.490336 0.000095
C  3.184103 2.255696 -0.000108
C  -3.400497 1.233771 0.000087
C  3.906511 -1.464956 0.000295
C  -4.82955 -1.199555 0.000101
C  5.326999 0.972087 0.000033
C  -4.803618 1.232637 0.000099
C  -5.534439 0.009454 0.000107
C  5.309835 -1.467442 0.000313
C  6.029917 -0.239928 0.000169
H  -0.859664 2.125195 -0.000062
H  1.352641 -2.361164 0.000115
H  -0.782919 -3.492289 0.000112
H  1.27576 3.254977 -0.000158
H  -3.275487 -3.417988 0.000097
H  3.768087 3.18382 -0.000198
H  -2.897268 2.203767 0.000099
H  3.380885 -2.424988 0.000433
H  -5.378212 -2.148591 0.000116
H  5.868856 1.925661 -0.000066
H  -6.632086 0.017055 0.000131
H  5.852865 -2.41901 0.000451
H  7.125324 -0.245425 0.000176
H  -6.423445 2.386411 0.000114
