program: Gaussian 09
title: 000135491
version: EM64L-G09RevD.01
frameworkgroup: C1[X(C8H18NO2PS)]
method: RPBEPBE
basis: SDD
operation: Freq
keyword: #p
keyword: freq=noraman
keyword: PBEPBE/SDD
title: #p freq=noraman PBEPBE/SDD
converged: YES YES NO NO
title: Mulliken charges:
elementType: S P O O N C C C C C C C C H H H H H H H H H H H H H H H H H H
charge: -0.033817 1.000867 -0.476259 -0.585676 -0.761992 0.033306 -0.400836 -0.426442 -0.392789 -0.390730 -0.388524 -0.833928 -0.486071 0.228842 0.180608 0.241026 0.216537 0.183124 0.205718 0.197140 0.196407 0.202806 0.203296 0.190581 0.333495 0.264501 0.268277 0.317100 0.239426 0.231649 0.242357
chargesum: 0.00000
title: Mulliken charges with hydrogens summed into heavy atoms:
elementType: S P O O N C C C C C C C C
charge: -0.033817 1.000867 -0.476259 -0.585676 -0.428496 0.262148 0.020798 -0.026781 0.010069 0.008484 0.005352 0.015950 0.227361
polarizability: 1.81944783e+02 9.56073908e+00 1.29367233e+02 1.09180357e+01 -3.08730331e+00 1.19388535e+02
1716.lowfreq: 0.0014 0.0014 0.0025 5.9586 8.3974 13.7224 27.2957 41.7871 61.0421
frequency: 27.1141 41.6903 60.9690 73.1959 96.5358 112.8263 128.7161 148.8719 157.3865 172.5084 207.0424 218.2859 228.3148 268.2582 298.5452 319.2216 357.4324 395.2239 409.9878 428.5731 451.6349 488.6765 500.7277 536.5728 625.5198 639.9702 783.4023 788.5810 816.2425 853.0917 887.5157 892.7744 919.6578 967.6953 973.5490 977.7302 1009.6666 1028.6086 1044.8629 1054.2525 1075.3927 1083.4614 1112.0592 1114.3351 1125.9854 1140.6745 1192.0587 1230.2679 1252.8680 1255.3378 1289.5092 1308.7890 1329.4540 1335.8610 1340.5554 1341.9284 1351.8409 1356.0911 1394.5636 1420.8255 1452.1232 1457.2560 1460.7062 1464.5901 1466.1174 1466.6225 1472.5162 1474.4529 1479.9927 2957.3421 2966.9289 2969.0529 2971.2486 2971.6906 2973.5896 2990.9907 2993.6045 3031.4776 3033.1019 3040.0098 3040.6302 3049.9708 3070.4416 3116.0755 3120.6667 3152.7853 3513.1853
redmass: 3.4280 3.6368 4.6805 3.4522 2.1179 1.3575 3.9922 3.9722 1.1388 3.5427 4.0454 3.1869 2.2193 5.7180 5.8381 2.1528 3.8124 4.0874 3.5097 3.3293 2.1762 2.1018 2.8451 1.9591 7.5271 7.8073 1.4484 2.3146 3.6402 2.4677 1.6577 1.4771 1.8913 6.9844 2.3166 1.3290 1.2431 8.3689 1.6620 1.2238 1.3502 4.5737 2.5379 1.2542 1.3058 2.2097 1.5105 1.3061 1.2456 1.2849 1.2177 1.2910 1.4183 1.3748 1.4797 1.4558 1.3699 1.1350 1.2651 1.1209 1.0508 1.0486 1.0873 1.0884 1.0560 1.0896 1.0775 1.0575 1.0948 1.0656 1.0658 1.0648 1.0623 1.0611 1.0304 1.0809 1.0329 1.0964 1.0964 1.0991 1.1006 1.1029 1.1043 1.0984 1.1021 1.1069 1.0756
irintensity: 0.7887 0.0930 1.8939 2.7022 2.3685 0.2852 2.1698 5.4403 0.4298 9.0700 7.0642 2.2938 1.9315 10.8591 4.2832 0.7575 14.8989 28.1327 13.4796 11.0022 0.9104 47.9909 118.3904 9.8442 92.8966 4.3420 0.3130 4.9405 64.1196 45.7552 11.5304 11.5223 0.4554 81.3312 33.5022 21.3106 20.6383 77.2113 1.1858 3.3186 1.3406 156.9037 0.4048 0.7234 0.5599 16.4491 4.7411 12.9086 5.9200 1.9526 20.0754 0.7227 2.3361 1.5216 2.2353 1.4412 0.9625 3.7980 42.5162 6.0654 8.8753 12.3241 3.7743 11.4655 13.6763 4.1351 12.1234 23.3688 4.6219 22.6804 16.6370 33.9321 20.8560 37.7143 45.9340 25.4482 33.2116 67.5603 77.1581 1.6761 13.4446 110.9048 33.4425 4.2418 13.5740 11.9222 18.5006
temp: 298.150 k
press: 1.00000 atm
elementType: 16 15 8 8 7 6 6 6 6 6 6 6 6 1 1 1 1 1 1 1 1 1 1 1 1 1 1 1 1 1 1
symmnumber: 1
zpe: 679481.6 jmol-1
zpe.correction: 0.258801 hartree
zpe.thermalcorrener: 0.275381 hartree
zpe.thermalcorrenthalpy: 0.276325 hartree
zpe.thermalcorrgfe: 0.213578 hartree
zpe.sumelectzpe: -1259.056517 hartree
zpe.sumelectthermal: -1259.039937 hartree
zpe.sumelectthermalent: -1259.038992 hartree
zpe.sumelectthermalfe: -1259.101740 hartree
dipole: 1.9197 2.0771 -2.4954
dipole: 3.7718
quadrupole: -86.3243 -93.7641 -100.8651
quadrupole: -0.5758 2.1800 6.6348
quadrupole: 7.3269 -0.1129 -7.2140 -0.5758 2.1800 6.6348
hfenergy: -1259.3153178 hartree
pointgroup: C01 [X(C8H18N1O2P1S1)]
dipole: 0.7818833 0.8732898 -0.909992 debye
polarizability: 181.6159163|8.3793086|129.5716574|12.7632864|-2.3406042|119.5129769 unknown
InChI: InChI=1S/C7H15NO2P.CH3S/c1-10-11(9)8-7-5-3-2-4-6-7;1-2/h7-8H,2-6H2,1H3;1H3
charge 0 multiplicity 1
31 atoms
S  -3.393667 0.364287 -1.184193
P  -1.753249 -0.161889 0.351469
O  -1.639254 1.079493 1.566408
O  -1.991257 -1.567722 1.071391
N  -0.3586 0.163163 -0.622164
C  1.020313 0.174517 -0.059333
C  1.594916 -1.248526 0.166975
C  1.936083 1.002669 -0.990105
C  3.036592 -1.180322 0.726473
C  3.381564 1.065765 -0.438386
C  3.960033 -0.349057 -0.195935
C  -4.617368 -0.985091 -0.65817
C  -1.717987 2.490584 1.138146
H  0.958994 0.686032 0.923069
H  1.59666 -1.788565 -0.80303
H  0.931918 -1.811213 0.85102
H  1.51664 2.018653 -1.114984
H  1.949727 0.527361 -1.994446
H  3.438355 -2.203423 0.854376
H  3.015207 -0.718862 1.735573
H  3.38162 1.628229 0.518081
H  4.024352 1.630627 -1.140575
H  4.973276 -0.274081 0.243678
H  4.070063 -0.871242 -1.169054
H  -0.440683 -0.111109 -1.60689
H  -4.898736 -1.546877 -1.560496
H  -5.493383 -0.511299 -0.194202
H  -4.109057 -1.650867 0.061996
H  -2.718027 2.71275 0.722008
H  -0.940567 2.726419 0.387408
H  -1.551778 3.073097 2.056891
