program: Gaussian 09
title: 000011842
version: EM64L-G09RevD.01
frameworkgroup: C1[X(C6H3Br3)]
method: RPBEPBE
basis: SDD
operation: Freq
keyword: #pfreq=noraman
keyword: PBEPBE/SDD
title: #p freq=noraman PBEPBE/SDD
converged: NO NO NO NO
title: Mulliken charges:
elementType: Br Br Br C C C C C C H H H
charge: 0.106586 0.072569 0.072580 -0.146758 -0.144493 -0.144496 -0.189110 -0.189099 -0.209867 0.262576 0.262575 0.246937
chargesum: 0.00000
title: Mulliken charges with hydrogens summed into heavy atoms:
elementType: Br Br Br C C C C C C
charge: 0.106586 0.072569 0.072580 -0.146758 -0.144493 -0.144496 0.073466 0.073475 0.037071
polarizability: 1.52974824e+02 -7.14591182e-04 1.32816109e+02 -1.40341707e-03 -1.80169200e-03 4.02291061e+01
1716.lowfreq: -0.0001 0.0002 0.0002 2.0282 2.8496 4.5996 49.8858 129.7484 134.4360
frequency: 49.8843 129.7484 134.4358 175.6319 211.2358 221.8337 315.3265 370.9292 408.7749 497.1950 508.4251 678.7527 691.6174 692.1053 776.7567 899.4995 974.5669 975.6026 1058.5176 1119.0815 1141.7214 1196.4985 1339.4900 1378.5262 1404.9182 1552.8901 1553.4700 3153.5311 3171.2911 3183.7878
redmass: 18.9986 44.6868 70.1496 4.4727 66.7582 6.6568 6.7599 10.8424 7.7991 3.9664 5.2964 7.5165 4.0693 8.5959 1.3381 1.3575 1.3399 8.5775 4.1901 2.0154 1.7005 1.2608 11.4045 2.6432 2.0212 6.4584 6.9145 1.0872 1.0928 1.0999
irintensity: 0.1840 0.1075 0.0764 0.0000 0.0788 7.5462 4.2338 4.7440 0.4243 0.2432 0.0000 10.1441 12.4591 76.3427 62.7542 0.0000 0.4225 6.1114 13.2116 16.7959 24.6359 14.2258 4.3046 50.2299 79.5583 0.0027 57.0735 2.2869 1.2009 6.0496
temp: 298.150 k
press: 1.00000 atm
elementType: 35 35 35 6 6 6 6 6 6 1 1 1
symmnumber: 1
zpe: 179236.8 jmol-1
zpe.correction: 0.068268 hartree
zpe.thermalcorrener: 0.077139 hartree
zpe.thermalcorrenthalpy: 0.078083 hartree
zpe.thermalcorrgfe: 0.030933 hartree
zpe.sumelectzpe: -270.164219 hartree
zpe.sumelectthermal: -270.155348 hartree
zpe.sumelectthermalent: -270.154404 hartree
zpe.sumelectthermalfe: -270.201553 hartree
dipole: 0.0001 2.6887 0.0000
dipole: 2.6887
quadrupole: -77.9767 -67.4958 -83.1352
quadrupole: -0.0002 -0.0002 0.0001
quadrupole: -1.7741 8.7068 -6.9327 -0.0002 -0.0002 0.0001
hfenergy: -270.2324862 hartree
pointgroup: C01 [X(C6H3Br3)]
dipole: -0.0002116 1.0578049 0.0000137 debye
dipolederiv: 0.0688713 0.0001606 0.0000004 0.0001617 -0.5472605 0.0000682 -0.0000017 0.0000774 0.0383213 -0.5642152 -0.2140319 -0.0000361 -0.235397 -0.0748317 -0.0000228 -0.000061 -0.0000225 0.0073537 -0.5644259 0.2138089 0.000039 0.2351652 -0.074613 -0.000022 0.0000562 -0.0000159 0.0073627 -0.5630718 -0.0003625 -0.000002 -0.0003781 0.9132783 -0.0001838 -0.000007 -0.0001698 -0.0590922 0.9842533 0.3021424 0.0001003 0.5160482 -0.0449551 0.0001035 0.0001273 0.0000878 -0.0839863 0.9846389 -0.3016603 -0.0000958 -0.5155523 -0.0453399 0.0000977 -0.0000993 0.0000705 -0.0839929 -0.2572937 -0.0997297 -0.0000334 -0.1908282 -0.1015117 -0.0000206 -0.0000325 -0.000007 -0.0951008 -0.2574276 0.0996594 0.0000121 0.1907715 -0.1013867 -0.0000264 -0.0000023 -0.000025 -0.0951007 0.1333264 0.0000215 -0.0000043 0.0000132 0.0555396 0.000009 -0.0000029 0.0000315 -0.133273 -0.0082037 0.0575203 0.0000042 0.0540219 0.0521612 0. -0.0000086 -0.0000166 0.1646677 -0.0081532 -0.0575499 0.0000124 -0.0540572 0.0521004 0.0000061 0.0000227 -0.0000004 0.1646666 0.0517013 0.0000213 0.0000033 0.0000312 -0.083181 -0.0000089 0.0000092 -0.00001 0.1681739 unknown
polarizability: 152.9748231|0.0038561|132.8161092|-0.001403|-0.001802|40.2291061 unknown
InChI: InChI=1S/C6H3Br3/c7-4-2-1-3-5(8)6(4)9/h1-3H
charge 0 multiplicity 1
12 atoms
Br 0.000663 -2.648679 0.00025
Br -2.956317 -0.872789 -0.000159
Br 2.95671 -0.871401 -0.000207
C  0.000154 -0.703045 0.000029
C  -1.221367 0.021668 0.000015
C  1.221354 0.022236 -0.00005
C  -1.224151 1.434247 0.000041
C  1.223463 1.43481 -0.000051
C  -0.000511 2.136346 0.000024
H  -2.174285 1.97516 0.000073
H  2.173328 1.976193 -0.000126
H  -0.000739 3.230454 0.00006
