program: Gaussian 09
title: 000135464
version: EM64L-G09RevD.01
frameworkgroup: C1[X(C18H18N3)]
method: RPBEPBE
basis: SDD
operation: Freq
keyword: #p
keyword: freq=noraman
keyword: PBEPBE/SDD
title: #p freq=noraman PBEPBE/SDD
converged: YES YES NO NO
title: Mulliken charges:
elementType: N N N C C C C C C C C C C C C C C C C C C H H H H H H H H H H H H H H H H H H
charge: -0.447426 -0.069946 -0.699320 0.046783 -0.020260 0.126745 0.199537 0.218481 0.259132 0.360914 0.184667 -0.386176 -0.833169 -0.544357 -0.301706 -0.816320 -0.348009 -0.231701 0.526798 -0.416295 -0.592720 0.323868 0.271225 0.225576 0.260443 0.260400 0.239210 0.270229 0.224789 0.255727 0.256182 0.249364 0.276720 0.239335 0.242354 0.272613 0.272531 0.318378 0.325406
chargesum: 1.00000
title: Mulliken charges with hydrogens summed into heavy atoms:
elementType: N N N C C C C C C C C C C C C C C C C C C
charge: -0.123558 -0.069946 -0.055536 0.046783 -0.020260 0.126745 0.199537 0.218481 0.259132 0.360914 0.184667 -0.114951 -0.086749 -0.305146 -0.031478 -0.079623 -0.098645 0.045018 0.526798 -0.176961 0.194777
polarizability: 4.95167947e+02 -2.00816112e+00 2.35420151e+02 -8.61569413e-03 -1.68207937e-02 9.42460270e+01
1716.lowfreq: -7.4127 -5.9496 -0.0005 0.0001 0.0007 4.2360 11.9675 38.0628 61.9854
frequency: 10.5282 37.6570 61.9752 73.3436 89.4716 113.1986 128.2925 156.4090 169.3999 203.4919 231.1371 242.0928 279.1807 307.7102 317.4803 338.8613 350.0449 372.5613 375.0648 404.6920 427.8088 430.7861 441.7957 457.7207 462.0171 464.3740 527.5428 552.2705 570.8043 583.9089 602.9429 618.3167 627.0093 658.5440 685.7458 716.5336 733.5973 753.4731 781.2758 798.0109 819.2194 821.9353 823.1906 864.8154 881.6355 902.9161 915.7802 943.3934 956.9353 971.5295 1026.8772 1032.5604 1037.4132 1043.1692 1053.5292 1066.2138 1099.3703 1120.7859 1126.4704 1139.1291 1169.3791 1176.3541 1214.0043 1242.0762 1253.7971 1294.2377 1328.8862 1341.6769 1345.9385 1362.6986 1384.9918 1407.0327 1412.4415 1413.9371 1420.1532 1441.4266 1448.5736 1466.2200 1468.5751 1469.9200 1471.7694 1481.3966 1485.9249 1488.6044 1499.4795 1510.4471 1519.0665 1584.6986 1593.4804 1599.6413 1633.6828 1644.2314 1653.0179 2987.0838 2988.3219 3012.7147 3061.3551 3063.6318 3092.3064 3110.5647 3113.3375 3137.0116 3139.3283 3160.5040 3169.6707 3179.9267 3196.7529 3205.3952 3562.7441 3598.8099 3699.8075
redmass: 1.2468 2.1223 3.4101 1.0529 2.2466 2.7802 4.5335 1.8026 3.2064 3.1074 3.3464 3.7032 3.9120 3.4220 3.6525 4.4203 4.3159 3.2723 1.0623 3.7608 3.5985 2.5171 1.3987 5.3278 3.0983 4.7496 5.1041 2.8142 1.2937 5.6567 3.9254 4.1975 3.5463 4.9570 6.3283 5.2447 4.9967 3.5752 4.6765 1.8815 1.5174 2.2274 4.8655 1.8425 2.8172 1.5801 3.3891 1.3617 1.3110 2.5896 2.8679 1.5021 1.5678 1.5743 1.8148 2.3431 1.9863 1.3351 2.8328 1.6538 1.7618 2.8832 1.7075 1.8786 1.5806 1.9655 2.3460 4.5003 2.4340 2.4763 2.5337 1.7200 1.2085 2.1444 2.2048 1.5908 3.7597 1.0442 1.0436 2.1809 1.0486 1.3419 1.6015 1.2898 4.3745 4.3055 2.1490 7.0416 5.5764 6.1523 5.3041 3.5462 1.4252 1.0391 1.0409 1.0340 1.0976 1.0984 1.0965 1.1037 1.0946 1.1026 1.0882 1.0971 1.0915 1.0886 1.0918 1.0997 1.0457 1.0799 1.1040
irintensity: 1.8249 1.1083 0.0442 0.2644 0.8515 3.6046 1.1957 1.0493 0.0651 8.2842 1.9847 0.0316 0.2745 0.6058 6.7924 0.5225 2.1419 0.4677 1.7150 0.3221 0.3599 76.2150 242.7423 0.9589 0.0122 0.2858 8.7353 21.4896 73.0619 0.6939 14.8015 2.7281 0.4304 5.9248 0.3393 0.3979 4.0022 0.3102 1.9929 24.9741 51.0689 26.1901 3.0814 29.6742 1.1423 11.7768 1.8476 0.1628 0.1243 0.3297 17.3947 2.5577 2.0380 1.6483 1.6258 20.3354 2.8815 1.3873 1.9436 6.5520 12.6975 137.3936 12.2846 62.6688 15.1126 16.3824 14.0802 15.8448 119.3349 31.3184 24.8829 16.5335 11.4175 23.0476 7.4936 31.0546 60.3819 2.7105 33.8777 11.6466 17.2355 13.9572 56.7904 82.2963 266.8648 2.2357 13.6724 14.6402 294.7642 78.1478 75.4048 18.0991 277.9329 17.9429 6.6773 32.5561 6.0882 8.5504 11.5239 5.5512 17.7367 4.3079 8.6933 11.6880 12.1038 2.7655 0.7820 0.1543 199.2205 96.2646 28.2102
temp: 298.150 k
press: 1.00000 atm
elementType: 7 7 7 6 6 6 6 6 6 6 6 6 6 6 6 6 6 6 6 6 6 1 1 1 1 1 1 1 1 1 1 1 1 1 1 1 1 1 1
symmnumber: 1
zpe: 840442.2 jmol-1
zpe.correction: 0.320108 hartree
zpe.thermalcorrener: 0.338842 hartree
zpe.thermalcorrenthalpy: 0.339786 hartree
zpe.thermalcorrgfe: 0.272347 hartree
zpe.sumelectzpe: -859.350155 hartree
zpe.sumelectthermal: -859.331421 hartree
zpe.sumelectthermalent: -859.330477 hartree
zpe.sumelectthermalfe: -859.397916 hartree
dipole: -5.0362 -1.7665 0.0099
dipole: 5.3371
quadrupole: -18.7778 -77.1345 -128.2340
quadrupole: 4.3034 -0.0158 -0.0126
quadrupole: 55.9377 -2.4191 -53.5186 4.3034 -0.0158 -0.0126
hfenergy: -859.6702629 hartree
pointgroup: C01 [X(C18H18N3)]
dipole: 1.9865326 -0.6802043 0.0024018 debye
polarizability: 495.1230886|3.9430337|235.4446861|-0.4332421|-1.678482|94.26635 unknown
InChI: InChI=1S/C18H18N3/c1-10-15-9-21(3)7-6-13(15)11(2)18-17(10)14-8-12(19)4-5-16(14)20-18/h4-9,20H,19H2,1-3H3
charge 1 multiplicity 1
39 atoms
N  -1.421459 1.987675 -0.023451
N  4.259274 -1.025806 0.005122
N  -5.207917 -2.143986 0.025752
C  -0.530721 -0.134945 0.001647
C  -0.224526 1.298518 -0.016184
C  0.499331 -1.086495 0.014093
C  1.085172 1.822192 -0.023392
C  -1.993751 -0.253938 0.003617
C  1.858134 -0.581893 0.005206
C  2.134754 0.866793 -0.013489
C  -2.509917 1.083199 -0.0118
C  2.964188 -1.460082 0.01335
C  0.158394 -2.562502 0.036413
C  -2.894853 -1.344108 0.015867
C  3.518706 1.265525 -0.02124
C  1.355889 3.314852 -0.041484
C  -3.889481 1.352459 -0.01431
C  4.544489 0.343537 -0.012127
C  -4.29806 -1.092326 0.013685
C  -4.7748 0.260395 -0.001267
C  5.394209 -1.987909 0.0138
H  -1.517872 3.001354 -0.035395
H  2.834864 -2.542365 0.02622
H  1.030897 -3.231524 0.058708
H  -0.4558 -2.801753 0.924007
H  -0.436709 -2.834593 -0.854895
H  -2.542142 -2.378546 0.026139
H  3.783438 2.324826 -0.035123
H  0.428473 3.910165 -0.039601
H  1.938233 3.634822 0.842098
H  1.923246 3.615952 -0.941385
H  -4.278069 2.375659 -0.026055
H  5.600255 0.618582 -0.017806
H  -5.855078 0.444035 -0.002825
H  5.009302 -3.017956 0.029683
H  6.009123 -1.849686 -0.890743
H  6.016285 -1.824718 0.909223
H  -4.897832 -3.111568 0.036823
H  -6.208968 -1.968542 0.023915
