program: Gaussian 09
title: 000135448
version: EM64L-G09RevD.01
frameworkgroup: C1[X(C18H25Cl2NO)]
method: RPBEPBE
basis: SDD
operation: Freq
keyword: #p
keyword: freq=noraman
keyword: PBEPBE/SDD
title: #p freq=noraman PBEPBE/SDD
converged: YES YES NO NO
title: Mulliken charges:
elementType: Cl Cl O N C C C C C C C C C C C C C C C C C C H H H H H H H H H H H H H H H H H H H H H H H H H
charge: -0.025463 -0.029313 -0.221789 -0.085238 -0.186278 -0.410639 -0.361444 -0.427639 -0.354202 0.141832 -0.357617 -0.616452 -0.624550 -0.306642 -0.696012 -0.262811 0.596016 -0.306214 -0.363938 -0.223367 -0.233762 -0.103424 0.199215 0.214755 0.243627 0.174734 0.201407 0.197642 0.245842 0.192859 0.189228 0.196193 0.191674 0.218362 0.190074 0.231477 0.225027 0.190689 0.222098 0.219157 0.214751 0.209789 0.211809 0.291803 0.239259 0.285318 0.262155
chargesum: 0.00000
title: Mulliken charges with hydrogens summed into heavy atoms:
elementType: Cl Cl O N C C C C C C C C C C C C C C C C C C
charge: -0.025463 -0.029313 -0.221789 -0.085238 0.012937 0.047743 0.014696 0.015846 0.027885 0.141832 0.030250 0.023462 0.013265 -0.087486 -0.059664 0.028993 0.596016 -0.306214 -0.124679 0.061951 0.028394 -0.103424
polarizability: 3.77258407e+02 -3.15594265e+01 1.90152469e+02 1.21344542e+01 -3.13730193e+01 1.98337802e+02
1716.lowfreq: -10.2130 -5.5321 -0.0017 -0.0013 -0.0011 3.9722 8.1181 9.7121 18.2938
frequency: 6.1808 7.4883 17.9446 31.4668 33.0775 41.8721 51.3781 63.0713 84.0162 103.6493 105.6603 118.3502 137.8761 149.0329 160.6117 172.6251 188.0615 201.8385 207.3349 214.1013 222.5765 228.5943 266.4278 268.4552 298.2103 342.9808 348.6352 357.5066 370.1589 396.2251 401.9728 435.7451 439.2470 448.5197 507.7128 548.9501 561.2719 631.7728 659.0327 681.2971 718.4109 725.8210 732.6533 761.2107 813.2408 818.1572 825.3535 851.4275 864.9474 871.0540 893.4107 897.9349 919.0941 956.4992 972.0243 995.9556 1016.9881 1019.7458 1024.8942 1033.4881 1038.9918 1056.9550 1066.2746 1077.1819 1084.1563 1089.4722 1099.5984 1103.4684 1121.3341 1136.3941 1138.1085 1176.0359 1198.6720 1216.6414 1237.3891 1248.8128 1263.8579 1268.7894 1273.4305 1284.2985 1286.9044 1288.3988 1301.1174 1308.7635 1316.0222 1327.3214 1341.5988 1351.7706 1360.1819 1367.3270 1387.5318 1389.3364 1418.0901 1440.3134 1456.7693 1460.9514 1462.4234 1462.6628 1464.0551 1471.6302 1473.6893 1476.6496 1476.6951 1480.4121 1485.4673 1487.5915 1544.2058 1552.6452 1588.6302 1638.5531 2845.8596 2847.5925 2865.9583 2944.8560 2955.4602 2965.3841 2971.9585 2973.4551 2986.0336 2987.0935 3002.1600 3018.8731 3023.4864 3028.3844 3045.8076 3050.6921 3068.8319 3070.5464 3077.3349 3081.2027 3116.5461 3125.5463 3154.4682 3179.3644 3186.9380
redmass: 6.3424 5.8047 2.7562 2.8035 3.5708 2.1271 7.5997 4.5779 3.1816 3.5261 2.9822 1.8229 3.4810 5.7122 5.7028 3.9715 2.7018 3.8917 2.6065 2.1997 1.1918 1.1206 2.7515 3.3454 3.4588 4.1095 4.4532 2.4254 10.2251 2.5847 7.8396 2.8569 2.6730 3.0535 4.4236 4.4805 3.4673 6.6609 5.5427 3.4508 2.5548 1.2883 2.6655 1.4449 3.1256 1.6500 2.5994 1.6437 2.6887 1.4111 1.9688 1.8001 1.9926 1.3701 1.5449 3.0387 1.1739 2.7142 3.6184 1.5378 2.4470 2.7263 2.0738 2.3272 2.3422 1.4170 1.6377 2.2028 1.9621 1.5240 1.5817 1.9351 1.5932 1.5691 1.4040 1.3408 2.4692 1.3722 1.4291 1.4663 1.0828 1.4239 1.2729 1.3179 1.2889 1.6604 1.5944 1.6516 2.8256 1.5433 1.2164 5.2881 1.1416 1.1528 2.6803 1.0566 1.0779 1.0686 1.0760 1.0721 1.0755 1.0438 1.0527 1.0798 1.0529 1.0872 7.5529 7.5766 6.9948 5.6535 1.0684 1.0574 1.0589 1.0597 1.0589 1.0598 1.0367 1.0626 1.0784 1.0968 1.1012 1.0729 1.0718 1.1041 1.1006 1.0913 1.1007 1.0993 1.1007 1.1005 1.0933 1.0865 1.0882 1.0966 1.0938
irintensity: 0.5413 0.0328 0.3411 0.4604 0.4610 0.1327 1.6444 0.7157 1.2564 0.6054 1.2622 0.0437 0.4351 0.2173 0.0204 0.1527 0.4393 0.5443 0.4914 0.6639 0.2774 0.0041 7.6088 2.0799 1.8947 1.0345 1.6374 7.3981 14.4997 0.9929 18.9416 2.9741 0.7689 9.7786 0.8617 6.6007 8.0587 5.1931 7.0231 4.0292 33.2858 5.1433 0.6994 12.3892 48.0148 14.0473 37.5549 3.2004 5.0063 21.0184 7.2965 3.5356 5.3308 0.6771 5.7764 9.4088 41.8058 40.6513 76.7279 19.8101 9.7911 21.3313 28.0251 10.7960 126.1088 4.2974 18.3990 90.4742 8.2685 18.0407 20.7173 54.3530 9.2126 11.2345 9.0459 2.1435 29.4976 26.4040 6.7389 9.1232 2.5005 36.9391 1.4494 10.3455 4.3894 41.2695 2.1533 0.9500 38.9586 53.4399 11.7315 19.0751 2.1134 3.5342 137.6480 6.3019 1.4134 3.3664 12.0418 10.6216 7.5022 17.2414 14.1717 3.9901 17.3192 22.8088 236.4458 17.1242 65.0035 129.7208 36.0238 74.9314 274.5233 13.8657 3.9537 68.4749 35.1697 29.3145 42.1860 7.9374 2.1261 43.9816 45.0703 32.3827 37.0921 25.9281 86.5039 48.7504 26.0051 59.5531 6.3081 7.9975 3.8352 2.1047 0.9087
temp: 298.150 k
press: 1.00000 atm
elementType: 17 17 8 7 6 6 6 6 6 6 6 6 6 6 6 6 6 6 6 6 6 6 1 1 1 1 1 1 1 1 1 1 1 1 1 1 1 1 1 1 1 1 1 1 1 1 1
symmnumber: 1
zpe: 1015896.6 jmol-1
zpe.correction: 0.386935 hartree
zpe.thermalcorrener: 0.412530 hartree
zpe.thermalcorrenthalpy: 0.413474 hartree
zpe.thermalcorrgfe: 0.324371 hartree
zpe.sumelectzpe: -1749.290471 hartree
zpe.sumelectthermal: -1749.264875 hartree
zpe.sumelectthermalent: -1749.263931 hartree
zpe.sumelectthermalfe: -1749.353035 hartree
dipole: 0.5715 1.0386 -3.5504
dipole: 3.7431
quadrupole: -146.8316 -150.5432 -147.9143
quadrupole: -3.2977 -5.0997 3.0971
quadrupole: 1.5981 -2.1135 0.5154 -3.2977 -5.0997 3.0971
hfenergy: -1749.6774056 hartree
pointgroup: C01 [X(C18H25Cl2N1O1)]
dipole: -0.129804 0.075304 -1.4649811 debye
polarizability: 370.4014199|-50.0409609|180.8227217|-9.4011697|22.0789895|214.5245365 unknown
InChI: InChI=1S/C18H25Cl2NO/c1-4-5-6-7-15(13-21(2)3)18(22)11-9-14-8-10-16(19)12-17(14)20/h8-12,15H,4-7,13H2,1-3H3
charge 0 multiplicity 1
47 atoms
Cl 3.819659 0.429513 3.170852
Cl 7.055505 -1.101718 -1.026981
O  -1.002567 1.213877 2.219167
N  -4.187939 2.661048 -0.290864
C  -2.163732 1.182235 0.074094
C  -3.043423 -0.102685 0.174282
C  -2.425324 -1.357893 -0.480369
C  -2.969152 2.436544 0.517968
C  -3.363897 -2.584397 -0.417397
C  -0.921608 1.035591 0.962506
C  -2.756926 -3.852175 -1.061053
C  -5.185381 3.492429 0.413435
C  -3.903227 3.173171 -1.645555
C  0.36212 0.653896 0.30925
C  -3.701823 -5.071749 -0.997569
C  1.510027 0.495554 1.041225
C  2.832867 0.116385 0.536612
C  3.969275 0.041554 1.395781
C  3.063917 -0.205784 -0.836649
C  5.251291 -0.323118 0.943251
C  4.328637 -0.574156 -1.324401
C  5.411308 -0.627411 -0.420938
H  -1.835684 1.29398 -0.979302
H  -3.247443 -0.298267 1.246604
H  -4.012556 0.140759 -0.302179
H  -2.185602 -1.138934 -1.54336
H  -1.464488 -1.614314 0.012068
H  -2.293433 3.33031 0.500941
H  -3.265995 2.284427 1.571006
H  -3.616019 -2.798031 0.642164
H  -4.322178 -2.33976 -0.921389
H  -1.801786 -4.096181 -0.552525
H  -2.500282 -3.636541 -2.118806
H  -6.110425 3.552843 -0.188456
H  -4.835294 4.537655 0.610217
H  -5.437346 3.028892 1.383262
H  -3.252336 2.470795 -2.19467
H  -3.401406 4.175121 -1.638918
H  -4.846887 3.267373 -2.212226
H  0.335652 0.512774 -0.778491
H  -3.245628 -5.963984 -1.464763
H  -4.653037 -4.863633 -1.522968
H  -3.947731 -5.327578 0.050353
H  1.418429 0.675125 2.120928
H  2.222733 -0.170155 -1.535537
H  6.09596 -0.367176 1.634279
H  4.474976 -0.817613 -2.379977
