program: Gaussian 09
title: 000135357
version: EM64L-G09RevD.01
frameworkgroup: C1[X(C16H15N3O)]
method: RPBEPBE
basis: SDD
operation: Freq
keyword: #p
keyword: freq=noraman
keyword: PBEPBE/SDD
title: #p freq=noraman PBEPBE/SDD
converged: NO YES NO NO
title: Mulliken charges:
elementType: O N N N C C C C C C C C C C C C C C C C H H H H H H H H H H H H H H H
charge: -0.270399 -0.450161 -0.126281 -0.047809 0.338041 0.174072 0.364225 -0.062224 -0.379844 -0.349736 0.436122 -0.380747 -0.401601 -0.525336 -0.389661 0.346308 -0.217419 -0.379845 -0.805824 -0.537637 0.276681 0.201100 0.329673 0.234872 0.232438 0.289289 0.262244 0.221897 0.240498 0.226247 0.229039 0.239447 0.219294 0.243762 0.219277
chargesum: 0.00000
title: Mulliken charges with hydrogens summed into heavy atoms:
elementType: O N N N C C C C C C C C C C C C C C C C
charge: -0.270399 -0.120488 -0.126281 -0.047809 0.338041 0.174072 0.364225 -0.062224 -0.103163 -0.148636 0.436122 -0.145875 -0.169163 -0.236048 -0.127417 0.346308 0.004478 -0.139347 -0.111092 0.144696
polarizability: 3.56177487e+02 7.38089379e+00 2.12765002e+02 6.38855856e-01 1.99513021e-01 8.65508907e+01
1716.lowfreq: -7.4091 -0.0009 -0.0006 -0.0002 4.6635 5.8867 9.9005 23.3926 36.2417
frequency: 4.8830 23.2062 36.2363 47.4922 65.3899 80.5094 116.4261 130.5047 189.1226 203.8870 219.9561 249.8844 265.2587 290.6484 311.0418 347.3622 364.5626 389.6243 403.3926 453.4617 455.9561 507.6717 525.6918 549.4368 583.6513 611.5960 635.9445 667.0542 675.9082 688.0579 698.4716 726.7475 747.2600 793.0610 796.5176 814.5071 825.1742 858.7253 888.8015 923.5775 936.7185 953.2291 967.4444 977.3864 980.8067 987.7346 993.9075 1008.2715 1012.8045 1047.6360 1063.9260 1090.1809 1096.7089 1111.5236 1124.6066 1133.1005 1157.1735 1179.2869 1197.3849 1214.2518 1227.0524 1242.0742 1281.8887 1301.2207 1322.0858 1350.9553 1376.4359 1394.9853 1398.4687 1406.2924 1419.8047 1433.2773 1461.4309 1466.3877 1469.8730 1472.2877 1474.0908 1477.4536 1512.1290 1555.5543 1581.2935 1588.4652 1626.6090 1629.7421 2954.5855 2975.7153 3039.4633 3057.3661 3087.7684 3112.0951 3124.2267 3128.8896 3132.9202 3139.5057 3162.3798 3167.2105 3172.4073 3177.2937 3618.0438
redmass: 1.1581 2.7388 4.1611 4.9807 4.6018 3.8593 4.4660 5.0041 3.5213 1.9066 4.6510 4.3047 1.7765 5.1128 3.4210 4.9960 4.8154 4.9025 2.8362 5.2393 3.1574 2.8710 5.9968 4.5826 5.4269 5.4692 6.9640 1.8087 6.9359 2.1446 2.0778 3.0255 4.2658 5.1593 1.6943 6.5275 1.5224 1.3005 1.4144 1.5383 8.2981 1.3551 8.3948 1.3341 5.9093 1.4107 1.3624 5.8618 2.9362 1.5754 2.6237 1.9415 2.2994 1.2609 1.9322 2.1449 1.3866 1.1584 1.1186 3.1535 3.1125 5.1262 1.8134 1.7261 2.0393 1.7653 6.0012 7.8378 1.2239 3.1798 3.2224 1.2817 2.1085 1.0499 1.2177 1.1187 1.2362 1.7072 4.9716 4.7613 6.0222 6.2612 6.6623 6.3763 1.0334 1.0390 1.1036 1.0945 1.0999 1.0871 1.0987 1.0899 1.0872 1.0962 1.0918 1.0954 1.0967 1.0933 1.0823
irintensity: 0.4576 0.1735 0.6786 0.6886 9.2016 2.2933 0.0305 2.5129 0.3334 0.0645 1.3375 0.2721 1.0482 5.5165 0.5000 3.1049 0.0260 0.7692 0.0846 0.1320 2.6174 16.4304 7.2670 4.6669 0.9123 3.9091 0.2817 72.4599 4.5958 3.2337 33.6536 0.0639 62.3371 1.7721 26.5116 27.0182 46.5153 12.1459 0.0085 28.1996 6.5779 2.2218 17.3353 1.3689 7.4220 0.5480 2.2171 97.0815 5.5284 22.8699 4.8059 26.6554 4.2504 0.2742 18.9987 16.7766 2.1288 8.9733 11.4718 105.2293 1.8170 43.5825 21.1371 0.9726 3.9748 6.4095 2.2067 20.0448 10.4197 99.5118 5.3842 27.9080 139.4416 12.7464 31.7945 26.9898 46.3651 76.6811 12.9625 0.0701 6.7603 59.6609 38.4064 31.7980 79.5307 37.3415 52.2877 22.3705 16.8424 18.2592 26.5772 21.4037 12.6815 24.2510 12.3865 2.2980 10.9281 4.1390 52.4710
temp: 298.150 k
press: 1.00000 atm
elementType: 8 7 7 7 6 6 6 6 6 6 6 6 6 6 6 6 6 6 6 6 1 1 1 1 1 1 1 1 1 1 1 1 1 1 1
symmnumber: 1
zpe: 723265.0 jmol-1
zpe.correction: 0.275477 hartree
zpe.thermalcorrener: 0.293115 hartree
zpe.thermalcorrenthalpy: 0.294059 hartree
zpe.thermalcorrgfe: 0.225639 hartree
zpe.sumelectzpe: -856.769876 hartree
zpe.sumelectthermal: -856.752238 hartree
zpe.sumelectthermalent: -856.751294 hartree
zpe.sumelectthermalfe: -856.819714 hartree
dipole: 2.0107 -0.2150 0.0654
dipole: 2.0232
quadrupole: -70.4124 -105.6002 -123.2488
quadrupole: -8.0519 0.4170 0.0917
quadrupole: 29.3414 -5.8464 -23.4950 -8.0519 0.4170 0.0917
hfenergy: -857.0453528 hartree
pointgroup: C01[X(C16H15N3O1)]
dipole: 0.7903829 0.0909082 -0.0253103 debye
polarizability: 356.2872379|-6.2317809|212.6561935|-0.4606863|0.0880888|86.5499485 unknown
InChI: InChI=1S/C16H15N3O/c1-11-6-8-12(9-7-11)15-17-16(19-18-15)13-4-3-5-14(10-13)20-2/h3-10,18H,1-2H3
charge 0 multiplicity 1
35 atoms
O  -4.356766 -2.277387 0.002525
N  1.013298 2.170135 0.000684
N  0.165806 0.114411 0.002914
N  -0.363694 2.374234 -0.001906
C  2.682497 0.255095 0.005947
C  1.328983 0.817907 0.003429
C  -2.27503 0.768087 -0.002112
C  -0.838626 1.084567 -0.000508
C  2.837926 -1.156993 0.009905
C  3.847191 1.068717 0.00895
C  5.29194 -0.927501 0.013624
C  4.121803 -1.732594 0.015246
C  5.128234 0.482443 0.01427
C  -2.685309 -0.583719 0.000692
C  -3.247595 1.807551 -0.006297
C  -4.063286 -0.902756 -0.000612
C  -4.613666 1.475135 -0.007582
C  -5.039729 0.124804 -0.004773
C  6.673689 -1.553983 -0.013211
C  -5.766533 -2.668189 0.001747
H  1.936959 -1.778084 0.012419
H  3.768537 2.16317 0.011233
H  1.627646 2.980548 0.000364
H  4.22132 -2.824658 0.022003
H  6.015918 1.126364 0.020292
H  -1.940412 -1.383812 0.003922
H  -2.918192 2.850458 -0.008431
H  -5.366243 2.271685 -0.010802
H  -6.108572 -0.107561 -0.005831
H  7.423569 -0.905384 0.472541
H  6.683623 -2.533222 0.496586
H  7.010817 -1.723366 -1.054599
H  -6.290933 -2.295827 0.904064
H  -5.7604 -3.767914 0.004759
H  -6.288571 -2.30076 -0.903953
