program: Gaussian 09
title: 000135384
version: EM64L-G09RevD.01
frameworkgroup: C1[X(C16H11F4N3O)]
method: RPBEPBE
basis: SDD
operation: Freq
keyword: #p
keyword: freq=noraman
keyword: PBEPBE/SDD
title: #p freq=noraman PBEPBE/SDD
converged: YES YES NO NO
title: Mulliken charges:
elementType: F F F F O N N N C C C C C C C C C C C C C C C C H H H H H H H H H H H
charge: -0.209250 -0.199484 -0.190051 -0.194474 -0.449192 -0.121474 -0.050930 -0.116752 0.007905 -0.450580 0.307122 0.287810 0.221985 0.256685 -0.303105 -0.322302 -0.517497 -0.512241 -0.413079 -0.395417 -0.153211 0.374596 0.368341 -0.291238 0.259508 0.259357 0.251679 0.263604 0.371315 0.289071 0.284219 0.265578 0.263877 0.294466 0.263157
chargesum: 0.00000
title: Mulliken charges with hydrogens summed into heavy atoms:
elementType: F F F F O N N N C C C C C C C C C C C C C C C C
charge: -0.209250 -0.199484 -0.190051 -0.194474 -0.077878 -0.121474 -0.050930 -0.116752 0.007905 0.068285 0.307122 0.287810 0.221985 0.256685 -0.051425 -0.058698 -0.228425 -0.228022 -0.147501 -0.131540 0.141255 0.374596 0.368341 -0.028081
polarizability: 2.29948375e+02 1.08489225e+01 1.58257760e+02 1.59047707e+01 2.33236872e+00 1.62746195e+02
1716.lowfreq: -6.7270 -0.0004 0.0004 0.0006 3.3088 5.5494 31.3915 36.3160 42.8088
frequency: 31.3393 36.2782 42.7938 44.7580 54.0169 71.1655 105.9124 141.5115 160.9549 167.7871 215.3837 222.7279 224.5883 235.1871 275.9344 289.0885 307.4636 320.7357 338.2144 351.2526 404.3473 414.8056 451.5147 457.7885 477.4935 481.7840 500.6689 517.7496 533.3116 550.9486 572.8234 602.8999 603.4653 624.1445 658.4356 667.2673 705.8011 714.2136 718.2497 738.5386 741.4398 811.7006 817.6346 823.2633 845.6585 855.3055 856.2167 858.5241 905.5458 916.8560 930.0791 945.2271 947.8866 956.4684 966.4618 1009.9283 1036.8082 1073.5248 1075.3410 1110.2381 1127.4907 1142.7185 1147.7206 1176.7835 1182.7365 1186.6035 1221.2722 1237.8282 1242.1736 1254.0537 1271.8453 1291.9383 1307.4922 1333.7599 1359.4624 1371.5618 1380.7396 1393.6917 1412.3694 1418.8770 1430.6648 1466.5388 1481.9317 1490.6532 1593.3654 1597.1019 1622.3622 1625.7963 3036.9179 3122.3561 3164.9197 3172.4060 3187.8661 3190.6355 3195.2820 3196.0377 3253.6758 3268.9912 3530.3231
redmass: 9.7853 7.8754 6.2866 6.4197 8.2120 8.0763 6.0056 8.3663 7.3551 6.8221 9.7194 7.4880 7.5122 9.7625 10.8105 8.2107 8.8113 11.2644 7.1268 4.9877 2.6570 5.1322 2.9451 3.1579 5.2727 1.7111 3.0056 5.1068 7.1507 6.6618 5.4130 4.2265 3.9675 4.3718 4.1771 3.2646 4.7306 7.3367 5.1170 3.4877 5.2569 1.4487 1.4904 1.4367 1.4007 1.5966 1.5957 3.1912 4.8132 5.5361 4.2862 1.6017 4.3171 3.5412 1.5191 3.1979 3.4381 2.2279 2.2336 2.3679 1.7966 1.4988 1.6793 2.0642 1.5707 2.8540 4.4270 3.9416 4.4620 1.4793 1.4263 2.2328 2.0356 1.9154 1.5371 7.1048 8.2129 2.6838 4.3204 4.1257 3.0760 1.2662 3.0830 2.5682 8.0836 8.6135 7.8853 7.8256 1.0621 1.1017 1.0887 1.0885 1.0965 1.0968 1.0941 1.0945 1.0975 1.1018 1.0654
irintensity: 0.7304 0.3897 0.4294 1.5503 0.3264 0.5300 1.7364 1.9505 1.6377 0.8614 0.3235 0.4111 0.9484 0.9658 5.0969 4.8406 0.2556 4.0670 1.8766 0.4230 2.9857 0.6402 24.9261 7.6123 6.9489 99.6650 98.9794 8.4648 7.8789 29.3703 5.1818 16.0453 22.5865 5.2153 11.0061 30.7397 0.0607 3.1551 1.8737 6.3413 3.7932 19.2084 48.4025 4.0443 15.6785 54.7659 61.9763 32.7990 35.0293 3.4394 44.9775 12.4538 50.3446 30.4271 3.5735 1.5980 72.6378 59.9134 21.9934 24.8338 20.4639 14.8766 5.7209 1.4133 18.4671 3.2406 28.0271 14.6352 84.6159 11.4788 1.4880 45.7215 64.4362 19.7482 1.5344 6.9938 8.0512 19.4263 14.0967 15.7591 32.7647 44.7370 106.7303 58.9789 27.1612 52.9949 102.2770 67.0989 24.6101 0.8486 0.3067 3.8087 1.6097 0.4080 1.6185 3.0802 1.1457 2.6754 26.7897
temp: 298.150 k
press: 1.00000 atm
elementType: 9 9 9 9 8 7 7 7 6 6 6 6 6 6 6 6 6 6 6 6 6 6 6 6 1 1 1 1 1 1 1 1 1 1 1
symmnumber: 1
zpe: 637647.9 jmol-1
zpe.correction: 0.242867 hartree
zpe.thermalcorrener: 0.262982 hartree
zpe.thermalcorrenthalpy: 0.263926 hartree
zpe.thermalcorrgfe: 0.192812 hartree
zpe.sumelectzpe: -1253.418547 hartree
zpe.sumelectthermal: -1253.398433 hartree
zpe.sumelectthermalent: -1253.397488 hartree
zpe.sumelectthermalfe: -1253.468603 hartree
dipole: -3.4703 -0.2239 0.4214
dipole: 3.5029
quadrupole: -153.6750 -142.1270 -130.1778
quadrupole: 8.7966 -0.6229 5.3532
quadrupole: -11.6817 -0.1338 11.8155 8.7966 -0.6229 5.3532
hfenergy: -1253.6614146 hartree
pointgroup: C01 [X(C16H11F4N3O1)]
dipole: -1.3613689 0.1529643 -0.1503914 debye
polarizability: 228.2966411|-14.491009|159.5829213|-16.4194609|3.3414565|163.0727678 unknown
InChI: InChI=1S/C16H11F4N3O/c17-10-1-3-12(14(19)5-10)16(24,7-23-9-21-8-22-23)13-4-2-11(18)6-15(13)20/h1-6,8-9,24H,7H2
charge 0 multiplicity 1
35 atoms
F  -1.888049 -0.648326 -2.111201
F  -0.24667 -0.78548 2.044688
F  -5.821006 0.223867 0.523574
F  2.607508 -4.225322 0.264457
O  0.033212 1.348361 -1.74512
N  1.957179 2.006767 0.263222
N  2.874855 1.542678 1.221597
N  3.970798 2.413148 -0.633814
C  -0.14455 0.805228 -0.382071
C  0.524608 1.882217 0.519047
C  -1.653321 0.675863 -0.082868
C  0.581332 -0.548857 -0.229374
C  -2.482752 -0.055897 -0.962599
C  0.510492 -1.296815 0.965731
C  -2.305374 1.265876 1.028378
C  1.400139 -1.075276 -1.256292
C  -3.861635 -0.233789 -0.804022
C  1.160693 -2.521029 1.166871
C  -3.692934 1.12594 1.243587
C  2.081744 -2.302637 -1.10998
C  2.633251 2.51596 -0.826307
C  -4.441137 0.375316 0.322086
C  1.939257 -3.000953 0.100201
C  4.066158 1.815646 0.62138
H  0.02487 2.847262 0.326625
H  0.423468 1.611278 1.580235
H  -1.727536 1.833237 1.761321
H  1.516094 -0.501038 -2.179477
H  -0.442207 0.759069 -2.387823
H  -4.451172 -0.812316 -1.518689
H  1.076965 -3.064091 2.110904
H  -4.184831 1.579162 2.107831
H  2.714016 -2.704516 -1.905565
H  2.134102 2.914175 -1.7034
H  5.01193 1.582092 1.102568
