program: Gaussian 09
title: 000135342
version: EM64L-G09RevD.01
frameworkgroup: C1[X(C5H12NO5P)]
method: RPBEPBE
basis: SDD
operation: Freq
keyword: #p
keyword: freq=noraman
keyword: PBEPBE/SDD
title: #p freq=noraman PBEPBE/SDD
converged: YES YES NO NO
title: Mulliken charges:
elementType: P O O O O O N C C C C C H H H H H H H H H H H H
charge: 1.237486 -0.673349 -0.674704 -0.628749 -0.414518 -0.228043 -0.573970 -0.299425 -0.395671 -0.782665 -0.178443 0.135827 0.215470 0.275355 0.209734 0.228673 0.289859 0.280001 0.250772 0.285398 0.282566 0.389410 0.388602 0.380385
chargesum: 0.00000
title: Mulliken charges with hydrogens summed into heavy atoms:
elementType: P O O O O O N C C C C C
charge: 1.237486 -0.283938 -0.286102 -0.628749 -0.034134 -0.228043 -0.006006 0.191400 0.042735 -0.212805 0.072329 0.135827
polarizability: 1.23057167e+02 3.58722064e-01 9.33521793e+01 5.37841892e+00 -2.00133811e+00 8.63936535e+01
1716.lowfreq: -7.0793 -0.0020 -0.0016 -0.0011 3.9946 4.8072 19.1612 33.3658 39.3250
frequency: 19.0619 33.2715 39.3092 62.4056 86.2471 116.9623 126.7994 134.5900 197.0736 199.9080 237.4301 256.6738 289.9218 299.4852 332.7643 343.9501 360.4982 379.2513 416.9417 497.2801 589.4443 607.7395 644.1675 678.4063 703.0484 721.0007 738.2376 768.6378 822.3720 851.0330 943.2928 980.6985 985.5183 1009.4386 1031.8595 1050.4342 1067.2123 1072.1829 1122.4820 1144.6718 1215.2912 1230.9906 1253.1940 1281.3115 1292.1266 1306.4465 1323.9810 1358.3245 1364.9011 1420.3006 1463.0872 1488.8446 1653.3361 1656.3259 2977.6105 2993.9355 3024.6980 3028.9554 3046.4301 3072.0009 3099.0945 3451.4528 3501.8985 3574.6230 3593.4370 3596.6860
redmass: 6.9553 6.3915 6.4643 5.2851 3.3303 2.2043 4.1936 2.0670 2.6863 1.4071 2.8446 3.8867 2.5923 4.2355 2.3795 4.1296 1.5710 2.7116 5.0820 3.0146 1.7335 2.0806 5.9347 1.7049 4.0553 7.6923 1.9040 1.7416 1.5155 3.9991 2.7282 2.1964 1.1987 1.5093 2.9203 3.0286 2.1279 1.9016 1.5048 2.5199 1.3553 1.4686 1.3209 1.3935 1.4091 1.1829 1.3396 1.4709 1.3866 1.0783 1.0777 1.0852 1.1284 6.9256 1.0617 1.0632 1.0587 1.0861 1.0960 1.1010 1.1041 1.0456 1.0641 1.0967 1.0659 1.0663
irintensity: 0.7761 0.8420 0.9285 0.2505 0.7782 0.2893 3.4210 11.2379 1.2916 42.9683 5.8847 8.7862 39.9909 5.6563 133.1311 72.8198 156.4638 21.2464 4.4485 12.9715 84.6624 54.9494 57.7643 246.2615 39.9117 272.8756 22.5075 97.1319 3.9016 27.3816 0.4464 1.6357 35.2719 11.9252 228.4350 20.1851 21.0630 65.2683 80.7609 24.6915 13.7904 10.8119 27.3488 2.4610 18.9700 3.9206 1.2808 1.6393 4.1112 7.2010 5.1833 13.0673 15.7139 265.8779 9.5797 18.2345 9.0221 5.5894 20.8346 11.6237 8.1995 2.1117 13.5417 5.3824 56.0374 39.5084
temp: 298.150 k
press: 1.00000 atm
elementType: 15 8 8 8 8 8 7 6 6 6 6 6 1 1 1 1 1 1 1 1 1 1 1 1
symmnumber: 1
zpe: 479887.9 jmol-1
zpe.correction: 0.182780 hartree
zpe.thermalcorrener: 0.198351 hartree
zpe.thermalcorrenthalpy: 0.199295 hartree
zpe.thermalcorrgfe: 0.137594 hartree
zpe.sumelectzpe: -968.855877 hartree
zpe.sumelectthermal: -968.840306 hartree
zpe.sumelectthermalent: -968.839362 hartree
zpe.sumelectthermalfe: -968.901063 hartree
dipole: -0.9642 -0.1442 -0.2590
dipole: 1.0087
quadrupole: -71.6267 -74.1520 -87.7450
quadrupole: 7.3278 -8.8276 5.8608
quadrupole: 6.2146 3.6892 -9.9038 7.3278 -8.8276 5.8608
hfenergy: -969.0386569 hartree
pointgroup: C01 [X(C5H12N1O5P1)]
dipole: -0.3783589 -0.0658818 -0.1000549 debye
dipolederiv: 1.9359158 -0.0728778 -0.127808 0.0104616 1.7916077 0.0682767 -0.1456347 0.0354003 1.4677985 -0.6798383 -0.0747063 0.1480834 -0.1390137 -1.1236517 0.0637848 0.1251399 0.1180207 -0.5251156 -0.9658996 0.1576231 0.3338634 0.1888425 -0.7640972 -0.0992361 0.3884741 -0.1388289 -0.7124835 -0.7783463 0.0175529 -0.0612752 -0.0386526 -0.6480582 0.0006193 -0.0025536 0.0384602 -0.7103794 -0.3969152 -0.1920238 0.1676369 -0.1652712 -1.0444763 0.3699462 0.1398571 0.314177 -0.5180662 -0.802258 0.1163313 -0.2988801 -0.0895386 -0.5936734 0.1397593 -0.2992527 0.2719134 -0.5816856 -0.6598501 -0.1596739 -0.0488466 -0.1007193 -0.6799826 -0.0289375 -0.0166623 0.0248753 -0.1864905 -0.0450168 -0.01661 0.0062845 -0.0282776 0.0381017 -0.0400387 -0.0934482 -0.0496191 0.0915318 -0.0118503 0.0301838 0.0106026 -0.0467899 0.0528904 -0.0528191 0.0050676 -0.0964853 0.1155666 -0.1697187 0.0051394 0.0004797 0.0479642 -0.0655882 0.0024306 -0.0912891 -0.0361368 -0.1444389 -0.018565 -0.0822345 -0.0358112 0.0109876 0.5682731 0.0402764 -0.0542477 -0.0168134 0.1732722 1.0134484 0.1310384 0.319981 0.3730526 1.0679156 -0.5255509 0.4112016 -0.6023869 0.665636 0.0591995 0.0084612 -0.0076537 0.0134237 0.0697036 0.045254 0.0062957 0.0370712 -0.1131857 0.1482392 -0.025781 0.0089772 -0.0489763 -0.0406963 -0.0077886 0.0106223 0.0059773 0.0757363 0.0312699 0.0159188 -0.0111192 -0.0006692 0.0681732 0.0542621 -0.0137305 0.0246015 -0.1367156 0.0623379 0.0038996 0.0051853 -0.0247564 -0.1356986 -0.0054785 -0.0162878 0.0246235 0.0741447 0.0475465 0.004604 -0.0441334 -0.0163031 0.0902615 0.0338868 0.0146007 0.0262131 -0.0516324 0.0494491 -0.0375547 -0.0003601 0.0271664 -0.0692168 -0.0156995 -0.0055629 0.0010279 0.0923287 0.1037761 -0.007514 -0.025387 -0.0087177 0.0279914 0.0248093 -0.0034678 0.0317768 -0.0911595 0.1653309 0.1701154 0.1266103 0.0730031 0.1691802 0.0084043 0.0819408 0.0126976 0.1399461 0.315469 0.1104275 -0.0907119 0.0329045 0.2011093 -0.0396744 -0.0542555 0.015189 0.0743519 0.2590832 -0.0126586 -0.1319513 -0.0452825 0.3303576 -0.0284805 -0.1370458 -0.0139937 0.2450172 0.1890549 -0.0014977 -0.1292491 0.0155265 0.3838644 -0.0162417 -0.091676 -0.0188753 0.2539954 0.1481379 -0.0881632 -0.1145175 -0.0403643 0.3057097 0.0082357 -0.1580853 -0.0088853 0.3020276 unknown
polarizability: 123.0304007|0.9907983|93.2313453|5.4086944|-2.1515981|86.5412534 unknown
InChI: InChI=1S/C5H12NO5P/c6-4(5(7)8)2-1-3-12(9,10)11/h4,7,9-10H,1-3,6H2
charge 0 multiplicity 1
24 atoms
P  3.261216 -0.076982 0.064251
O  3.320154 1.617356 -0.316868
O  4.286976 -0.850786 -1.105235
O  3.651152 -0.396389 1.578843
O  -3.611774 -1.562211 0.577177
O  -4.241566 0.131143 -0.885954
N  -2.081962 1.782084 0.120878
C  0.440291 0.097818 0.190662
C  -0.924187 -0.37672 -0.351504
C  1.597505 -0.522564 -0.617509
C  -2.103195 0.338867 0.375882
C  -3.424014 -0.326779 -0.057925
H  0.532345 -0.187219 1.257655
H  0.479083 1.200049 0.139458
H  -0.995934 -0.163603 -1.437684
H  -1.032603 -1.470125 -0.219502
H  1.594119 -0.178732 -1.666614
H  1.556113 -1.626489 -0.617185
H  -1.986794 0.163779 1.461408
H  -2.606693 2.336191 0.804722
H  -2.356533 2.020863 -0.839232
H  3.926161 2.141121 0.26636
H  5.203675 -1.039684 -0.779934
H  -4.455937 -1.981886 0.255151
