program: Gaussian 09
title: 000135330
version: EM64L-G09RevD.01
frameworkgroup: C1[X(C9H10N4O)]
method: RPBEPBE
basis: SDD
operation: Freq
keyword: #p
keyword: freq=noraman
keyword: PBEPBE/SDD
title: #p freq=noraman PBEPBE/SDD
converged: NO YES NO NO
title: Mulliken charges:
elementType: O N N N N C C C C C C C C C H H H H H H H H H H
charge: -0.242664 -0.101373 -0.145643 -0.616688 -0.624705 0.299290 -0.332957 -0.355505 -0.246963 -0.231724 0.085194 -0.230893 -0.367587 0.285291 0.257213 0.272380 0.225488 0.229041 0.228100 0.253548 0.347763 0.319846 0.311972 0.381576
chargesum: 0.00000
title: Mulliken charges with hydrogens summed into heavy atoms:
elementType: O N N N N C C C C C C C C C
charge: -0.242664 -0.101373 -0.145643 0.050921 0.068843 0.299290 -0.075744 -0.083125 -0.021474 -0.002683 0.085194 -0.002793 -0.114038 0.285291
polarizability: 2.30667456e+02 1.64810422e+01 1.53046398e+02 -1.05763325e+01 -1.65953817e+00 6.44344739e+01
1716.lowfreq: -5.5306 -2.8773 0.0004 0.0006 0.0011 8.0646 35.8794 50.0872 63.9372
frequency: 35.8579 50.0793 63.9302 101.4096 144.9849 170.4098 199.2188 220.3382 245.7200 324.4720 330.2500 381.0314 403.7319 423.3944 438.4305 463.1488 516.3177 538.1297 614.2231 624.1640 656.2322 666.6833 684.9433 701.5777 737.6188 743.8780 796.5931 856.8759 934.8618 938.2353 946.6353 982.6735 989.5458 1001.1812 1009.3765 1022.5320 1046.0078 1077.6063 1086.2640 1138.4245 1171.8557 1187.2548 1288.4428 1312.9630 1321.6064 1382.5196 1431.5282 1472.0390 1479.0069 1510.3319 1517.6222 1568.0024 1586.9588 1592.2928 1608.1465 1629.3640 3072.2218 3122.9652 3135.2725 3150.4242 3163.2870 3174.7181 3473.7948 3557.5700 3676.6641 3712.0642
redmass: 4.4535 4.4657 4.5607 6.7406 4.7653 2.0332 2.0976 3.0940 4.7700 5.2552 3.4060 6.1980 2.8598 3.6090 1.2410 2.9933 4.5800 1.1584 6.3503 5.2442 4.7908 3.4044 4.6181 1.4945 1.5019 3.9801 2.2777 1.2444 3.3185 1.4113 1.8263 1.3845 6.0408 1.3394 1.6210 2.6386 2.0321 2.2734 1.9557 3.6967 1.0556 1.1281 1.8451 1.5431 2.2104 8.6709 2.3187 2.7059 2.6436 3.3744 3.1152 3.2826 4.0119 2.3340 6.0527 1.6197 1.0889 1.0851 1.0891 1.0938 1.0977 1.0964 1.0502 1.0456 1.0985 1.1048
irintensity: 0.7650 0.5578 1.3163 2.0839 0.3100 1.4026 11.3864 14.1603 13.7264 4.3534 16.3448 4.8787 0.0837 4.2324 394.6928 1.1374 11.5869 52.0943 2.0909 35.6222 7.4153 17.1301 2.1320 97.5369 116.5168 13.3603 26.6832 3.0373 60.6375 23.0097 14.3089 2.6697 0.1421 1.0102 14.3453 28.7265 40.0050 114.0180 28.5540 187.6833 0.1306 11.7116 259.5306 22.7364 76.0859 2.9857 6.7284 609.6161 207.9778 81.4718 225.1896 9.9216 77.8565 233.3818 17.3046 427.6638 17.1120 0.3999 14.8872 19.1371 29.9527 8.3537 49.2628 137.9077 79.8553 50.2640
temp: 298.150 k
press: 1.00000 atm
elementType: 8 7 7 7 7 6 6 6 6 6 6 6 6 6 1 1 1 1 1 1 1 1 1 1
symmnumber: 1
zpe: 482130.4 jmol-1
zpe.correction: 0.183634 hartree
zpe.thermalcorrener: 0.196855 hartree
zpe.thermalcorrenthalpy: 0.197799 hartree
zpe.thermalcorrgfe: 0.142894 hartree
zpe.sumelectzpe: -642.154325 hartree
zpe.sumelectthermal: -642.141103 hartree
zpe.sumelectthermalent: -642.140159 hartree
zpe.sumelectthermalfe: -642.195065 hartree
dipole: -5.4640 -6.8582 -0.8479
dipole: 8.8096
quadrupole: -48.1313 -81.8337 -84.1151
quadrupole: 4.7705 -0.2952 0.8628
quadrupole: 23.2287 -10.4737 -12.7551 4.7705 -0.2952 0.8628
hfenergy: -642.3379584 hartree
pointgroup: C01 [X(C9H10N4O1)]
dipole: -2.0335899 2.4869867 1.3008591 debye
dipolederiv: -0.957184 0.1997324 0.1005916 0.2261187 -0.9912125 -0.2648495 0.1105232 -0.2081796 -0.4266886 1.342579 -0.6262724 -0.3375147 -0.6409427 -0.0626027 -0.0267862 -0.115309 -0.0395002 -0.156013 -1.9909237 0.6652481 0.3450328 0.8321418 -0.6672138 -0.2388934 0.407676 -0.2396302 -0.4124676 -1.8627974 0.2897546 0.0729041 0.3182998 -0.5117627 0.200847 0.0491239 0.217267 -0.5305732 -0.373766 -0.2730986 -0.188639 0.1625677 -0.9020495 -0.2442531 0.1888061 -0.281313 -0.8621648 -0.3627151 -0.2086767 -0.1018945 -0.249198 -0.2525513 -0.1210011 -0.1619131 -0.1197883 -0.0514025 -0.0347435 -0.0363216 0.074401 0.1288989 0.005572 0.0385143 0.1078634 0.0348535 -0.0682775 0.0586546 0.0841997 0.0652484 -0.11237 0.0768813 -0.0193438 -0.0016138 0.0336108 -0.1123991 -0.2145177 -0.0768554 0.0029492 -0.0510322 0.1232672 -0.0264879 -0.0263393 -0.0185964 -0.1647569 0.0812892 -0.0880411 0.1080421 -0.1354737 -0.1500679 -0.0325106 0.1046421 -0.0360362 -0.1134858 2.0914889 -0.1747374 -0.0682246 0.1815284 0.9620619 0.335958 0.2261353 0.274841 0.2685554 0.0069317 0.0562617 0.0849801 0.0361352 0.0725593 0.0391063 0.0644095 0.0301306 -0.1060738 -1.1134261 0.4270013 0.2178413 0.6248647 -0.063439 0.1017833 0.3042912 0.0601628 -0.0575657 2.219481 -0.2862113 0.0389351 -1.3937034 1.3040394 0.7110458 -0.7759123 0.7683147 0.8090529 0.0177089 0.0709702 -0.0798613 0.0890912 0.0801521 0.0054239 -0.0739004 -0.0161731 0.0952863 0.1360454 0.0043901 -0.0272089 0.060571 -0.0153137 0.0227758 0.0227234 -0.0097322 0.148889 0.0801018 0.0570577 -0.0297198 0.0072461 -0.1238819 0.0146322 -0.0389293 0.0144398 0.1385562 -0.0971337 0.0445108 -0.1018753 0.0496675 0.0682991 0.0204496 -0.1085323 0.0198669 0.1125004 -0.007118 -0.0975103 -0.0713739 -0.1135779 -0.0136136 -0.051474 -0.0760528 -0.0553149 0.1215836 -0.0290932 -0.0485978 -0.0514589 -0.0233523 0.004554 -0.1135708 -0.1076003 -0.095034 0.1118437 0.3272316 0.0178693 0.0050657 0.0640489 0.2454105 -0.106884 0.0472299 -0.1108256 0.3094696 0.2544991 -0.0035372 -0.0198149 -0.0538956 0.2636772 -0.1198135 -0.033391 -0.1212876 0.2940261 0.180255 0.024138 -0.0106587 0.0282461 0.2623513 -0.1032946 -0.0264208 -0.09371 0.3286971 0.2471525 -0.0212741 -0.027747 -0.0358803 0.2848834 -0.0213738 -0.0875095 -0.0083659 0.3234082 unknown
polarizability: 228.0864531|-24.4845662|143.9334446|7.3512774|29.2581355|76.1284303 unknown
InChI: InChI=1S/C9H10N4O/c10-9(11)13-12-6-8(14)7-4-2-1-3-5-7/h1-6H,10-11H2
charge 0 multiplicity 1
24 atoms
O  1.119947 -2.662522 -1.127424
N  -1.512126 -0.386889 -0.331452
N  -2.900323 -0.426544 -0.505125
N  -4.852483 0.686966 0.087762
N  -2.788786 1.456515 0.987609
C  1.515796 -0.444124 -0.266212
C  1.200884 0.939784 -0.347214
C  2.773993 -0.834739 0.268623
C  2.124604 1.906804 0.106856
C  3.687137 0.130873 0.736547
C  0.617934 -1.535784 -0.785564
C  3.364597 1.507295 0.657458
C  -0.847203 -1.375117 -0.906262
C  -3.485896 0.580485 0.196845
H  0.24702 1.249977 -0.781833
H  3.011631 -1.903466 0.296025
H  1.882275 2.972553 0.023896
H  4.649359 -0.183491 1.155861
H  4.077268 2.260681 1.012233
H  -1.367775 -2.179636 -1.450797
H  -5.314478 0.007988 -0.513471
H  -5.399545 1.374021 0.596836
H  -3.212801 2.214706 1.512534
H  -1.778329 1.288164 1.007069
