program: Gaussian 09
title: 000135322
version: EM64L-G09RevD.01
frameworkgroup: C1[X(C18H15N3O)]
method: RPBEPBE
basis: SDD
operation: Freq
keyword: #p
keyword: freq=noraman
keyword: PBEPBE/SDD
title: #p freq=noraman PBEPBE/SDD
converged: YES YES NO NO
title: Mulliken charges:
elementType: O N N N C C C C C C C C C C C C C C C C C C H H H H H H H H H H H H H H H
charge: -0.269630 -0.233993 -0.105538 -0.078812 0.155951 0.182691 0.391779 -0.036176 -0.231378 -0.358549 0.346928 -0.378518 -0.414283 -0.543231 -0.237431 -0.231396 -0.387048 0.365764 -0.220100 -0.382340 -0.242653 -0.685730 0.276176 0.239168 0.271599 0.234576 0.290546 0.234927 0.232334 0.262461 0.222483 0.246167 0.206520 0.206574 0.205034 0.232620 0.232504
chargesum: 0.00000
title: Mulliken charges with hydrogens summed into heavy atoms:
elementType: O N N N C C C C C C C C C C C C C C C C C C
charge: -0.269630 -0.233993 -0.105538 -0.078812 0.155951 0.182691 0.391779 -0.036176 0.044798 -0.119381 0.346928 -0.106920 -0.179707 -0.252685 -0.002504 0.000938 -0.124587 0.365764 0.002384 -0.136173 0.170442 -0.015572
polarizability: 3.97587663e+02 2.36671937e+01 2.51982809e+02 3.08727121e-02 -2.94419919e-02 9.30243670e+01
1716.lowfreq: -9.9463 -5.1875 -2.1153 -0.0008 -0.0001 0.0007 23.1539 46.2755 49.4024
frequency: 23.1195 46.2652 49.4020 66.2451 103.1664 135.1389 138.4739 146.6611 217.3570 217.7044 230.3427 231.3412 247.6837 275.5484 332.2815 346.9570 363.1455 422.7739 442.9522 453.8443 461.7484 504.6221 513.9443 562.3283 571.9493 586.4337 592.3593 634.4879 663.4575 690.4993 697.9955 717.0933 736.3083 757.8067 763.1036 785.8730 795.6014 803.2269 809.9720 828.5786 882.7034 889.0162 892.6252 909.0718 926.5012 938.1347 957.8450 971.3688 977.3008 983.8362 1000.1786 1004.1114 1032.2326 1039.5786 1078.5187 1085.0147 1103.9013 1117.2580 1129.7952 1135.2376 1174.3540 1178.7511 1193.5432 1203.9291 1223.6116 1227.8745 1252.2001 1259.9261 1289.3443 1303.0934 1338.1362 1362.3097 1388.7385 1392.5948 1399.9345 1400.8970 1421.5712 1441.5163 1454.5053 1460.4795 1477.9572 1478.7662 1491.1205 1510.2733 1524.8090 1553.8084 1585.3248 1610.4086 1624.3054 1639.0678 2950.2709 2996.5917 3008.0718 3093.7815 3105.5821 3127.5723 3133.7223 3141.5457 3157.0481 3162.9684 3166.0256 3171.6475 3172.5473 3176.0284 3212.7488
redmass: 4.3690 4.2580 4.9545 4.5410 1.9969 3.6919 4.1565 5.6864 3.7769 4.7313 2.6101 6.3241 1.6022 5.1431 3.5260 6.0680 5.4045 3.0284 5.8987 3.1832 6.0001 6.8481 3.7837 6.6585 3.6447 4.6885 5.8196 6.3931 6.8426 3.3623 2.6276 6.7021 4.1065 1.3238 6.5289 3.3202 1.7177 4.2535 1.4679 1.1096 5.0878 1.5133 1.4093 5.0224 1.5250 1.3070 4.2108 1.3921 1.3367 5.7540 1.3428 5.4184 2.2168 2.7537 2.4976 2.3366 1.7361 2.1469 1.5098 1.4341 1.1004 1.1450 2.6346 2.5321 2.8454 2.3670 3.6419 1.1452 1.6278 1.8480 2.5991 1.3845 5.3207 3.3246 1.6014 2.8343 2.6192 2.4843 2.8037 1.0399 3.2785 1.0998 1.1072 5.3389 7.7189 6.4250 6.2653 6.2324 6.7234 7.3050 1.0552 1.0362 1.1074 1.0989 1.1013 1.0868 1.0872 1.0897 1.0948 1.0917 1.0904 1.0999 1.0955 1.0944 1.0982
irintensity: 0.2776 4.7735 1.1103 0.6509 1.1773 0.0802 0.1514 1.6191 1.6281 0.1584 0.0006 1.1142 1.7603 1.3282 1.3826 1.1955 0.9174 8.1332 1.1755 3.6996 2.5609 1.1769 0.6222 0.8101 1.7448 5.4113 5.3698 0.9155 0.1188 17.0077 2.8192 4.8577 50.5271 21.6113 2.1224 0.0747 28.3792 7.8378 109.6754 0.0065 4.7614 2.5096 0.0050 33.1196 25.4261 0.0183 44.6875 4.0275 1.0602 2.9930 0.0624 5.0858 4.8708 109.8468 9.1329 34.5405 10.8886 7.3273 21.1842 4.3394 2.9936 14.3116 27.4073 150.5742 31.7716 31.6058 58.2188 0.0698 5.7619 8.7810 13.7786 26.3064 34.6125 37.1073 84.4628 20.4117 46.9586 40.4575 169.4401 11.7038 18.4272 5.4314 3.6747 79.3384 10.9890 1.2205 75.0053 12.9731 36.3102 19.8148 46.7801 28.7385 38.7562 32.3117 34.7211 2.4344 15.5484 11.6648 20.5911 14.2070 6.1859 20.3638 8.3608 7.8525 4.4171
temp: 298.150 k
press: 1.00000 atm
elementType: 8 7 7 7 6 6 6 6 6 6 6 6 6 6 6 6 6 6 6 6 6 6 1 1 1 1 1 1 1 1 1 1 1 1 1 1 1
symmnumber: 1
zpe: 757603.0 jmol-1
zpe.correction: 0.288556 hartree
zpe.thermalcorrener: 0.306099 hartree
zpe.thermalcorrenthalpy: 0.307043 hartree
zpe.thermalcorrgfe: 0.241876 hartree
zpe.sumelectzpe: -932.879177 hartree
zpe.sumelectthermal: -932.861634 hartree
zpe.sumelectthermalent: -932.860689 hartree
zpe.sumelectthermalfe: -932.925856 hartree
dipole: 1.2749 -0.0515 0.0046
dipole: 1.2759
quadrupole: -78.3752 -116.7392 -134.3185
quadrupole: -1.3845 -0.0101 0.0040
quadrupole: 31.4357 -6.9283 -24.5075 -1.3845 -0.0101 0.0040
hfenergy: -933.1677323 hartree
pointgroup: C01 [X(C18H15N3O1)]
dipole: 0.5004558 -0.0366639 0.0136664 debye
polarizability: 398.8577578|18.9198446|250.4799641|6.2156845|-3.6939527|93.2571169 unknown
InChI: InChI=1S/C18H15N3O/c1-2-22-15-8-5-7-14(12-15)17-19-18-16-9-4-3-6-13(16)10-11-21(18)20-17/h3-12H,2H2,1H3
charge 0 multiplicity 1
37 atoms
O  -4.519915 1.508042 -0.191762
N  1.770024 -1.516391 0.025318
N  0.439059 0.298145 -0.05239
N  0.47659 -2.038544 0.010561
C  1.734326 -0.10628 -0.012689
C  2.977733 0.621772 -0.004625
C  4.201831 -0.141489 0.042768
C  -0.289547 -0.892344 -0.036522
C  2.940495 -2.263221 0.071138
C  4.144665 -1.591215 0.080211
C  -1.758816 -0.936362 -0.068037
C  3.018034 2.043412 -0.041944
C  5.443004 0.563002 0.051313
C  -2.486082 0.274227 -0.114661
C  4.253036 2.708059 -0.032539
C  5.468921 1.964829 0.014236
C  -2.448085 -2.181967 -0.052063
C  -3.900006 0.248921 -0.145515
C  -3.853935 -2.192405 -0.083054
C  -4.595538 -0.986886 -0.129783
C  -5.994464 1.548642 -0.222438
C  -6.393313 3.021317 -0.269222
H  2.822644 -3.346558 0.097187
H  5.073394 -2.167289 0.116308
H  2.072739 2.593741 -0.077622
H  6.378991 -0.006661 0.087332
H  -1.957271 1.231108 -0.126917
H  4.28612 3.802275 -0.061107
H  6.427683 2.494507 0.021238
H  -1.875633 -3.113152 -0.01605
H  -4.390407 -3.147782 -0.070943
H  -5.688388 -1.024514 -0.152843
H  -6.361507 1.00385 -1.117094
H  -6.398114 1.050957 0.683841
H  -7.494281 3.117029 -0.289531
H  -6.010674 3.555501 0.617076
H  -5.981912 3.507025 -1.170374
