program: Gaussian 09
title: 000135298
version: EM64L-G09RevD.01
frameworkgroup: C1[X(C13H14N2O4)]
method: RPBEPBE
basis: SDD
operation: Freq
keyword: #p
keyword: freq=noraman
keyword: PBEPBE/SDD
title: #p freq=noraman PBEPBE/SDD
converged: YES YES NO NO
title: Mulliken charges:
elementType: O O O O N N C C C C C C C C C C C C C H H H H H H H H H H H H H H
charge: -0.206182 -0.205532 -0.206961 -0.211425 -0.206695 -0.353264 -0.209795 -0.296481 -0.124302 0.140071 0.197679 -0.492141 -0.472765 -0.446351 -0.178438 -0.201058 0.173169 -0.486432 0.155823 0.289958 0.288170 0.289491 0.220576 0.262376 0.226494 0.242453 0.274883 0.236152 0.216284 0.217375 0.263628 0.247440 0.355802
chargesum: 0.00000
title: Mulliken charges with hydrogens summed into heavy atoms:
elementType: O O O O N N C C C C C C C C C C C C C
charge: -0.206182 -0.205532 -0.206961 -0.211425 -0.206695 0.002538 0.080162 -0.008311 0.165189 0.140071 0.197679 -0.009188 -0.003818 0.064685 0.037845 0.016316 0.173169 0.024635 0.155823
polarizability: 2.00120060e+02 1.47565466e+01 1.40879525e+02 -3.00040280e+00 1.01729695e+00 1.24212342e+02
1716.lowfreq: 0.0005 0.0005 0.0008 4.5377 8.2896 17.7202 34.1878 39.1833 46.3412
frequency: 34.1230 39.1303 46.2367 68.4761 97.5246 115.0531 138.0561 150.2257 192.5280 211.6131 226.1594 240.4511 345.3738 357.3460 372.2836 375.5709 403.9696 447.1828 466.9033 484.6878 521.9399 544.2758 572.1097 586.6828 615.5051 630.0617 648.7014 671.1496 715.9112 737.0310 748.2143 763.9399 810.7536 822.9240 833.6663 872.4542 903.5350 911.8951 943.2972 954.9463 977.1622 989.2652 997.8322 1013.6874 1057.3017 1077.0571 1096.9264 1110.6572 1128.0914 1146.5439 1174.1913 1179.4088 1197.7906 1204.6316 1205.6150 1232.6357 1265.6503 1270.4919 1290.3153 1295.3955 1311.2750 1313.7517 1326.3284 1327.2588 1332.2515 1346.1739 1351.6586 1365.2421 1378.1975 1378.3693 1448.9242 1468.1915 1468.9835 1486.6913 1630.8365 1642.1812 1647.9631 1684.7042 1696.8141 2954.9741 2969.3819 2969.9427 2978.6169 2989.5099 3016.9364 3024.1268 3039.9245 3072.2317 3083.5218 3091.2024 3105.2143 3136.4581 3481.6233
redmass: 5.8575 3.8193 6.4794 4.9179 3.4660 6.1890 5.1322 8.6907 5.2499 2.5219 4.1837 4.6423 5.8112 9.7065 4.0309 2.5029 4.3864 5.1174 6.2677 5.6585 3.8083 3.8656 4.5716 6.8939 4.1154 4.0947 4.0844 1.5485 4.9740 4.0657 2.6602 3.0728 1.3805 2.7516 3.6013 3.3561 2.6380 2.4970 2.5730 1.9412 1.3500 2.0818 2.4991 2.6160 2.3859 3.3168 2.1099 2.7479 2.4724 1.7365 1.3773 1.4681 1.7770 1.2079 1.1642 1.3652 1.9178 1.4328 1.4423 2.6848 1.7613 1.4977 1.5002 1.8510 1.6398 1.8734 2.6500 1.5607 1.6959 1.6794 1.0822 1.0945 1.0713 1.0823 11.5851 10.4178 6.1560 7.1275 10.1076 1.0682 1.0770 1.0733 1.0753 1.0680 1.0974 1.0605 1.0910 1.0879 1.0968 1.1013 1.0843 1.0996 1.0760
irintensity: 0.5719 0.8678 0.2895 1.7906 0.1177 4.6063 2.7781 8.1433 3.9248 0.9625 1.9805 5.3113 12.9835 13.7114 10.7875 0.9114 2.4396 40.7776 3.9018 3.3595 5.8685 8.3646 3.1550 23.9744 2.7789 5.8561 7.0337 58.2486 10.6845 2.6831 1.1802 1.8647 102.2342 0.2877 32.5007 4.3092 14.8035 5.4166 3.5513 7.3390 1.2749 20.5866 3.7866 10.3676 1.6565 10.3392 0.1282 7.1949 64.4813 54.5109 4.7117 46.6467 177.3385 7.8169 12.2796 0.3385 201.3457 5.8340 6.8464 73.2142 39.5154 22.9220 4.4661 48.4775 14.4463 50.4365 145.0248 41.5684 5.6983 2.9740 12.7686 5.9389 22.7029 9.5521 468.7452 160.5039 409.8494 18.5121 5.9770 21.6791 41.2203 3.6500 10.0333 9.6755 14.4832 16.9433 11.3091 12.4919 6.8322 6.6889 5.9716 50.7774 42.5393
temp: 298.150 k
press: 1.00000 atm
elementType: 8 8 8 8 7 7 6 6 6 6 6 6 6 6 6 6 6 6 6 1 1 1 1 1 1 1 1 1 1 1 1 1 1
symmnumber: 1
zpe: 676201.1 jmol-1
zpe.correction: 0.257551 hartree
zpe.thermalcorrener: 0.273827 hartree
zpe.thermalcorrenthalpy: 0.274771 hartree
zpe.thermalcorrgfe: 0.212464 hartree
zpe.sumelectzpe: -912.834169 hartree
zpe.sumelectthermal: -912.817893 hartree
zpe.sumelectthermalent: -912.816949 hartree
zpe.sumelectthermalfe: -912.879256 hartree
dipole: -3.7479 0.8661 -2.0296
dipole: 4.3493
quadrupole: -116.1448 -116.0823 -112.7287
quadrupole: -4.3333 -5.3882 -6.2301
quadrupole: -1.1596 -1.0970 2.2566 -4.3333 -5.3882 -6.2301
hfenergy: -913.0917202 hartree
pointgroup: C01 [X(C13H14N2O4)]
dipole: 1.4734694 -0.4605592 -0.7380651 debye
polarizability: 200.4407522|14.3582362|139.9836335|1.3934271|-3.1085643|124.7875412 unknown
InChI: InChI=1S/C13H14N2O4/c16-10-6-5-9(11(17)14-10)15-12(18)7-3-1-2-4-8(7)13(15)19/h1-2,7-9,14H,3-6H2
charge 0 multiplicity 1
33 atoms
O  1.033922 1.867291 -1.471843
O  -0.092766 -1.540446 1.538913
O  -1.587579 1.497194 1.647701
O  -5.379537 -0.398161 -0.227004
N  0.168769 0.171826 -0.071575
N  -3.438525 0.509076 0.655204
C  2.407847 0.83658 0.368669
C  2.16008 -0.574355 0.982297
C  -1.229449 0.297587 -0.485508
C  1.18459 1.052853 -0.531977
C  0.636432 -0.730469 0.91917
C  3.776775 1.111547 -0.300353
C  2.809654 -1.736364 0.165932
C  -1.817745 -0.997023 -1.090231
C  4.621907 -0.122255 -0.538723
C  4.203195 -1.393852 -0.320159
C  -2.065927 0.816034 0.70827
C  -3.292444 -0.768086 -1.47938
C  -4.137925 -0.233568 -0.329016
H  2.264623 1.576085 1.184011
H  2.505074 -0.63329 2.02686
H  -1.234176 1.099097 -1.255348
H  4.358437 1.823782 0.316443
H  3.596682 1.639073 -1.259689
H  2.172585 -1.983691 -0.710259
H  2.82253 -2.645324 0.793876
H  -1.734217 -1.816151 -0.355401
H  -1.23223 -1.278531 -1.982857
H  5.638847 0.056191 -0.913062
H  4.878705 -2.23395 -0.527599
H  -3.769616 -1.698124 -1.829388
H  -3.367064 -0.040531 -2.313293
H  -4.007159 0.870853 1.431821
