program: Gaussian 09
title: 000135264
version: EM64L-G09RevD.01
frameworkgroup: C1[X(C4H3N3O2)]
method: RPBEPBE
basis: SDD
operation: Freq
keyword: #pfreq=noraman
keyword: PBEPBE/SDD
title: #p freq=noraman PBEPBE/SDD
converged: NO YES NO NO
title: Mulliken charges:
elementType: O O N N N C C C C H H H
charge: -0.380959 -0.188167 0.022358 0.028815 0.014690 -0.034546 0.169002 -0.279477 -0.283497 0.270180 0.268965 0.392636
chargesum: 0.00000
title: Mulliken charges with hydrogens summed into heavy atoms:
elementType: O O N N N C C C C
charge: 0.011676 -0.188167 0.022358 0.028815 0.014690 -0.034546 0.169002 -0.009297 -0.014532
polarizability: 8.87459363e+01 8.98366863e-01 7.30606639e+01 3.80423270e-03 -5.55292109e-03 2.93976582e+01
1716.lowfreq: -25.2602 -4.7139 -2.9836 -0.0005 0.0006 0.0010 8.3136 123.1320 206.2836
frequency: -24.8154 123.1316 206.2835 319.3165 370.7571 413.9308 476.4345 611.3921 615.6824 658.8701 698.8561 758.0539 836.1464 915.6196 930.9271 986.7617 1036.7666 1106.4077 1133.4679 1184.8146 1205.5680 1338.1737 1377.6078 1403.6696 1451.8564 1469.2637 1651.6924 3173.9754 3178.4639 3509.6070
redmass: 8.3741 10.3362 7.8248 3.3297 9.9158 3.7740 9.7345 5.0596 1.2672 9.5330 3.2907 6.5482 9.0758 13.8916 1.5802 1.4963 3.5514 3.8915 12.6324 5.2147 2.2638 2.6928 1.3195 2.1699 6.6767 3.7618 10.1138 1.0920 1.0966 1.0642
irintensity: 1.0080 0.3157 2.7530 0.1394 4.4451 13.1614 3.0698 75.4337 89.7045 16.0358 86.9836 1.1493 5.9078 0.2154 7.9817 0.0058 250.2052 0.1592 0.2529 4.8982 23.2212 92.9048 32.1710 34.7225 81.2528 53.1357 176.0869 12.3866 6.0442 46.1086
temp: 298.150 k
press: 1.00000 atm
elementType: 8 8 7 7 7 6 6 6 6 1 1 1
symmnumber: 1
zpe: 198242.1 jmol-1
zpe.correction: 0.075506 hartree
zpe.thermalcorrener: 0.081853 hartree
zpe.thermalcorrenthalpy: 0.082797 hartree
zpe.thermalcorrgfe: 0.044401 hartree
zpe.sumelectzpe: -468.250118 hartree
zpe.sumelectthermal: -468.243772 hartree
zpe.sumelectthermalent: -468.242827 hartree
zpe.sumelectthermalfe: -468.281223 hartree
dipole: 0.4342 1.4048 0.0026
dipole: 1.4704
quadrupole: -46.6047 -55.2751 -49.6208
quadrupole: -5.9104 -0.0180 0.0050
quadrupole: 3.8955 -4.7749 0.8794 -5.9104 -0.0180 0.0050
hfenergy: -468.3256246 hartree
pointgroup: C01 [X(C4H3N3O2)]
dipole: -0.1850982 0.5480824 -0.0010423 debye
dipolederiv: -0.5535925 -0.4771843 0.0002511 -0.4404421 -0.9498005 0.000528 0.001212 0.0031439 -0.393717 -0.7169 0.2765506 -0.0010196 -0.0321744 -0.758663 0.0020811 0.0008345 -0.0014237 -0.2853911 -0.6932891 -0.187777 -0.0005219 -0.1534642 -0.4259205 -0.0005392 -0.0014068 -0.0003874 -0.1234181 -0.6888835 0.1990048 -0.0002617 0.1560585 -0.4454457 0.0001213 -0.0013414 0.0000391 -0.119963 -0.4037543 -0.0014806 -0.0002759 0.0010365 -0.6558446 -0.0002958 -0.0008193 -0.0002501 -0.1533104 0.4861449 -0.0269121 0.0008588 0.0360974 0.3711231 0.0001825 0.0001232 0.0003098 0.1515416 1.2673435 0.1178726 -0.0000768 0.2863946 1.4135326 -0.0026296 -0.0011255 -0.0018748 0.1901044 0.5251231 0.1526396 0.0004481 0.1305371 0.5728628 0.0004294 0.0010468 0.0005382 0.0576076 0.4976804 -0.1499044 0.0002631 -0.1360282 0.5790919 0.0001766 0.0007965 -0.0000035 0.0563999 0.0552724 -0.0621572 -0.000042 -0.0603721 -0.0002945 -0.0001068 -0.0000329 -0.0002042 0.106535 0.0543583 0.0617888 0.0000288 0.0602311 -0.0044261 -0.0000217 0.0000762 0.00004 0.1060771 0.1704967 0.0975592 0.0003481 0.1521259 0.3037845 0.0000743 0.0006368 0.0000727 0.4075339 unknown
polarizability: 88.7819289|-0.4911365|73.0246714|0.0036592|0.0056496|29.3976582 unknown
InChI: InChI=1S/C4H3N3O2/c8-4(9)3-6-1-5-2-7-3/h1-2,8H
charge 0 multiplicity 1
12 atoms
O  2.322258 1.210504 -0.001538
O  2.436061 -1.112284 0.000299
N  -0.393696 -1.220517 0.000321
N  -0.374234 1.211114 0.001687
N  -2.492017 0.011786 -0.000976
C  0.246256 -0.009266 0.001593
C  1.763211 -0.062538 0.003834
C  -1.757581 -1.143808 -0.000832
C  -1.740215 1.155035 0.000416
H  -2.310564 -2.087398 -0.001981
H  -2.278308 2.107233 0.000519
H  3.315229 1.125537 -0.004341
