program: Gaussian 09
title: 000135343
version: EM64L-G09RevD.01
frameworkgroup: C1[X(C23H26O2)]
method: RPBEPBE
basis: SDD
operation: Freq
keyword: #pfreq=noraman
keyword: PBEPBE/SDD
title: #p freq=noraman PBEPBE/SDD
converged: YES YES NO NO
title: Mulliken charges:
elementType: O O C C C C C C C C C C C C C C C C C C C C C C C H H H H H H H H H H H H H H H H H H H H H H H H H H
charge: -0.444392 -0.256895 0.157483 0.179986 -0.565199 0.304195 0.314735 -0.733750 -0.754276 -0.732142 -0.752347 -0.620998 -0.458796 0.402678 -0.447794 0.222047 -0.837913 -0.418860 0.456953 -0.376680 -0.398081 -0.346046 -0.373958 0.243614 0.101543 0.208975 0.220766 0.215984 0.214518 0.223589 0.217900 0.222625 0.210371 0.214641 0.215257 0.224314 0.208622 0.223038 0.217230 0.264263 0.239284 0.223977 0.237712 0.237194 0.249873 0.232495 0.253180 0.236242 0.271270 0.269447 0.382130
chargesum: 0.00000
title: Mulliken charges with hydrogens summed into heavy atoms:
elementType: O O C C C C C C C C C C C C C C C C C C C C C C C
charge: -0.062262 -0.256895 0.157483 0.179986 -0.135459 0.304195 0.314735 -0.079659 -0.103380 -0.077930 -0.103457 -0.356735 -0.219512 0.402678 -0.223817 0.222047 -0.113134 -0.186365 0.456953 -0.123500 -0.161839 -0.074776 -0.104511 0.243614 0.101543
polarizability: 5.11695545e+02 3.00166700e+01 2.31128577e+02 5.05007805e+00 -1.54350877e+01 1.74464263e+02
1716.lowfreq: -16.2487 -6.9382 -3.0276 -0.0004 0.0005 0.0010 17.0803 20.1991 32.3874
frequency: 16.8341 19.2637 32.3627 52.1728 69.5683 74.2631 81.5649 95.4630 108.4846 142.9202 166.1173 177.6670 189.4080 204.8145 212.4523 221.0177 235.3201 236.7092 254.9048 270.5754 281.0190 300.9776 314.8256 325.0830 337.4588 353.7456 373.8535 378.7973 400.3960 414.8284 439.6134 486.4333 491.7793 511.8410 523.8275 532.2486 535.8184 551.6471 566.4273 586.3579 599.7493 630.0741 641.5051 683.8064 689.2544 715.2750 733.7239 763.7787 774.3921 798.3596 823.4508 831.1360 840.2038 854.0327 858.0136 882.8373 892.0169 898.5198 915.0740 927.1234 935.2420 949.0989 956.0168 958.3195 986.6618 990.1832 996.5923 997.1006 997.8926 1008.9494 1020.1049 1031.2624 1048.8808 1068.3603 1077.4835 1123.3044 1125.0189 1142.5028 1151.2968 1184.3923 1192.2585 1196.6590 1202.3468 1210.8597 1220.8111 1248.7889 1265.9677 1283.7189 1294.1799 1311.7383 1314.1590 1321.8992 1336.1830 1366.2197 1369.8455 1375.1806 1390.3126 1391.6952 1393.3116 1398.5428 1421.2245 1422.7593 1458.2013 1459.3116 1462.0289 1465.3168 1466.6847 1471.6435 1476.6613 1477.9292 1480.3339 1481.6483 1487.5777 1491.3321 1500.1070 1556.0865 1573.9525 1601.6546 1615.1325 1624.2883 1638.7368 2968.6669 2969.1585 2971.8875 2972.7035 2974.5632 2989.3201 3047.6177 3060.4450 3061.3623 3062.0252 3066.5362 3068.3895 3071.8812 3074.6297 3076.9981 3081.3279 3092.1212 3099.4291 3119.6272 3124.8501 3127.8925 3147.4232 3161.0786 3162.4621 3184.2119 3531.8347
redmass: 4.2874 4.6181 4.8125 3.0252 3.8731 3.5121 4.1982 3.9743 3.7235 4.1706 3.7465 3.4139 1.7661 1.2895 1.5202 1.1867 2.3215 1.3024 1.2608 2.4442 2.3117 2.4775 3.2105 2.9197 2.9614 3.0619 3.1017 2.4546 4.0648 2.8702 3.5509 6.0597 3.2552 2.8490 2.5222 3.0263 3.6119 3.7228 3.4980 1.2955 4.0037 6.6404 3.5484 3.9902 3.6901 5.5280 4.3573 4.3051 3.7546 4.1913 3.5170 1.5525 2.1446 1.3675 1.4394 2.9233 1.8855 1.6409 1.5474 1.5259 1.3729 1.9130 1.4176 1.8171 1.7600 1.5581 2.1161 1.3005 2.1384 1.3619 2.4459 1.6052 2.4233 1.5647 2.0780 1.6025 1.6791 1.8149 1.6777 1.8501 1.8514 3.7847 1.1960 2.8555 2.0237 2.1672 1.7150 1.8705 3.0289 1.6258 1.7592 2.6055 2.4804 5.3608 1.2061 1.1987 1.5989 1.3753 1.2037 1.4198 3.6645 3.4573 1.0717 1.0535 1.0533 1.0934 1.1314 1.1584 1.0773 1.2428 1.0806 1.0959 1.1277 1.3782 2.6021 6.8236 7.1036 6.0657 6.6931 6.5415 8.3964 1.0348 1.0350 1.0352 1.0361 1.0433 1.0606 1.1031 1.0996 1.0889 1.0997 1.0995 1.0987 1.1004 1.0999 1.0996 1.0986 1.0879 1.0992 1.0873 1.0904 1.0889 1.0948 1.0949 1.0888 1.0960 1.0641
irintensity: 0.0577 0.4418 0.1506 0.3286 0.3416 0.3364 0.4624 0.6324 0.2929 0.1707 0.0984 0.5639 0.7112 0.2694 0.0920 0.1123 0.2852 0.1204 0.2278 0.5672 2.0137 0.1358 0.7958 0.4361 2.1489 0.2571 2.4012 1.2550 18.5216 1.1161 0.2012 10.5716 11.6405 23.9862 17.4191 6.7985 1.7563 1.4609 16.4162 72.4680 20.7849 0.8817 9.2824 10.6503 66.9687 0.0864 11.4485 7.3880 1.2131 1.2892 5.7138 21.6847 10.1195 3.7558 13.4373 2.3323 2.2623 59.4915 18.2353 0.3157 1.1818 3.8958 0.6718 4.2334 10.4649 1.1227 109.9793 1.9253 127.5046 0.4473 190.9519 16.6432 4.1882 0.0872 13.5098 6.6682 24.2577 2.6325 223.3954 5.8683 0.3227 8.3699 3.0888 5.0437 17.0174 26.0393 2.2753 8.4119 6.5911 34.5417 32.1856 155.5472 6.3599 6.1925 0.3726 34.6607 7.1512 9.9645 2.2476 28.6443 15.6040 4.2708 3.0635 1.4716 0.2478 7.7878 16.1435 13.2005 16.9105 27.8252 1.2674 6.5990 23.3934 32.7003 15.4582 77.3342 4.6468 291.3156 147.8902 7.5712 395.8845 8.5599 44.3904 56.4100 30.0213 16.9718 58.2190 16.7386 0.8709 17.0192 12.4396 4.8357 152.2359 0.6814 61.2162 80.5542 11.2284 19.8844 23.0960 19.5431 8.3894 10.6032 22.0040 4.5683 3.4264 5.7526 61.7463
temp: 298.150 k
press: 1.00000 atm
elementType: 8 8 6 6 6 6 6 6 6 6 6 6 6 6 6 6 6 6 6 6 6 6 6 6 6 1 1 1 1 1 1 1 1 1 1 1 1 1 1 1 1 1 1 1 1 1 1 1 1 1 1
symmnumber: 1
zpe: 1112859.5 jmol-1
zpe.correction: 0.423866 hartree
zpe.thermalcorrener: 0.448532 hartree
zpe.thermalcorrenthalpy: 0.449476 hartree
zpe.thermalcorrgfe: 0.368546 hartree
zpe.sumelectzpe: -1040.702643 hartree
zpe.sumelectthermal: -1040.677977 hartree
zpe.sumelectthermalent: -1040.677033 hartree
zpe.sumelectthermalfe: -1040.757963 hartree
dipole: -3.9420 -1.3150 1.1394
dipole: 4.3090
quadrupole: -153.3175 -144.3496 -151.5646
quadrupole: -11.7298 11.0595 -0.1246
quadrupole: -3.5736 5.3943 -1.8207 -11.7298 11.0595 -0.1246
hfenergy: -1041.1265088 hartree
pointgroup: C01 [X(C23H26O2)]
dipole: 1.539941 0.2932705 0.6453929 debye
polarizability: 509.8697683|36.6677206|208.2289312|10.3720608|32.5024506|199.1896857 unknown
InChI: InChI=1S/C23H26O2/c1-15(12-16-6-8-17(9-7-16)21(24)25)18-10-11-19-20(13-18)23(4,5)14-22(19,2)3/h6-13,24H,14H2,1-5H3
charge 0 multiplicity 1
51 atoms
O  -7.652131 -0.350189 0.786365
O  -7.547024 -1.055155 -1.424113
C  3.945105 -1.684427 -0.231962
C  5.394553 0.416448 -0.11859
C  5.413576 -1.154182 -0.035228
C  3.108279 -0.43189 0.061029
C  3.915154 0.730694 0.127262
C  3.696897 -2.164896 -1.692466
C  3.6321 -2.848424 0.74263
C  5.827659 0.928471 -1.524638
C  6.318209 1.049393 0.954162
C  1.715174 -0.347072 0.23758
C  3.317998 1.983807 0.375619
C  1.090177 0.911621 0.487621
C  1.920762 2.06841 0.562237
C  -0.393306 0.998363 0.657787
C  -0.930023 1.991279 1.676335
C  -1.200384 0.189607 -0.1178
C  -2.661187 0.015973 -0.113133
C  -3.509742 0.250973 1.013819
C  -3.276952 -0.471913 -1.309517
C  -4.897841 0.041473 0.936327
C  -4.661866 -0.675713 -1.394831
C  -5.490631 -0.414119 -0.270398
C  -6.948302 -0.644345 -0.398073
H  6.108203 -1.594528 -0.774139
H  5.770505 -1.452726 0.969332
H  4.33695 -3.036668 -1.9257
H  2.642417 -2.467948 -1.833233
H  3.918284 -1.36781 -2.424364
H  4.318266 -3.697558 0.56308
H  3.747394 -2.528874 1.794314
H  2.59846 -3.22007 0.610219
H  5.726691 2.027901 -1.591294
H  6.885725 0.669669 -1.718943
H  5.211385 0.484769 -2.32653
H  6.289862 2.154517 0.909789
H  6.015757 0.741145 1.971497
H  7.36699 0.734847 0.79544
H  1.099541 -1.254213 0.225229
H  3.927195 2.894113 0.42746
H  1.469984 3.051873 0.733491
H  -0.259909 2.860375 1.77938
H  -0.993248 1.530092 2.682182
H  -1.93303 2.361278 1.407252
H  -0.692194 -0.384412 -0.905967
H  -3.075923 0.559181 1.967801
H  -2.645076 -0.677606 -2.181857
H  -5.535747 0.21657 1.807295
H  -5.12691 -1.038087 -2.317529
H  -8.617724 -0.527816 0.627869
