program: Gaussian 09
title: 000135255
version: EM64L-G09RevD.01
frameworkgroup: C1[X(C15H20O2)]
method: RPBEPBE
basis: SDD
operation: Freq
keyword: #pfreq=noraman
keyword: PBEPBE/SDD
title: #p freq=noraman PBEPBE/SDD
converged: YES YES NO NO
title: Mulliken charges:
elementType: O O C C C C C C C C C C C C C C C H H H H H H H H H H H H H H H H H H H H
charge: -0.221479 -0.264824 -0.170735 -0.582823 0.352431 -0.058641 0.006971 0.183461 0.227065 -0.666608 0.350577 -0.723018 -0.583352 -0.851711 -0.851586 -0.293605 -0.495741 0.250959 0.232124 0.235450 0.247598 0.249712 0.215338 0.215077 0.237240 0.246698 0.238082 0.225046 0.301643 0.240848 0.236321 0.233884 0.203525 0.197435 0.202467 0.199618 0.234555
chargesum: 0.00000
title: Mulliken charges with hydrogens summed into heavy atoms:
elementType: O O C C C C C C C C C C C C C C C
charge: -0.221479 -0.264824 0.080225 -0.115249 0.352431 -0.058641 0.006971 0.183461 0.227065 -0.419010 0.350577 -0.042891 -0.099414 -0.086940 -0.140533 0.107354 0.140900
polarizability: 2.31105255e+02 8.29290393e+00 1.78127081e+02 -1.10675167e+01 5.52510656e+00 1.08633780e+02
1716.lowfreq: -0.0009 -0.0007 -0.0007 3.3036 6.7855 9.4091 34.3641 38.7027 54.8713
frequency: 34.3427 38.6485 54.8344 73.8025 81.5081 133.4841 141.2396 146.8959 153.0135 174.6253 200.0170 216.6031 225.7846 233.9916 255.0082 278.4350 311.8719 333.1218 358.9348 365.4283 383.0507 427.6934 476.5242 513.2842 539.1243 546.7349 561.3810 603.3252 640.5201 675.6864 719.1661 780.6854 786.4698 813.6081 865.7881 888.4292 901.2238 918.8221 928.4587 976.3578 1009.5450 1027.0345 1030.3193 1035.2244 1042.4225 1048.4872 1070.6599 1083.2963 1087.2518 1115.1015 1125.1474 1137.9720 1156.5374 1178.4261 1180.3100 1206.6708 1228.7502 1238.4420 1268.9402 1276.5989 1297.1573 1301.0161 1313.2804 1377.2765 1380.6267 1386.2040 1399.7021 1400.1652 1423.6984 1425.9508 1436.5534 1455.3397 1457.4255 1466.8580 1471.1996 1472.2055 1474.1305 1479.7389 1480.8047 1489.4478 1495.9346 1500.8250 1584.1635 1598.9250 1620.6964 2915.1784 2926.7560 2963.6367 2971.7409 2975.5509 2976.4794 2982.3132 2985.1204 2996.2848 3023.7755 3040.8017 3050.0380 3052.8810 3078.2917 3078.8650 3086.8042 3091.9355 3102.6841 3109.2248 3122.6692
redmass: 3.5300 3.7750 3.2018 2.5382 3.6847 2.3258 2.0747 1.1128 1.2999 2.2223 1.9319 1.4196 1.2100 3.9906 3.6647 3.8961 2.7713 4.2672 2.4373 2.9195 3.6015 3.3126 4.1893 4.3370 3.2347 4.1836 3.1717 4.1709 4.7630 5.5740 3.9921 2.7868 4.0329 1.3469 1.4024 2.4219 4.2055 1.6066 2.1334 2.1794 1.4252 2.9421 1.9886 1.6016 1.6497 2.6492 5.4230 2.0612 1.8447 1.3173 2.0195 2.4117 1.4706 1.4495 1.2418 1.6142 2.1547 1.5854 1.4841 1.1793 1.7421 1.5721 5.7731 1.3167 2.8274 1.3820 1.2461 1.3030 3.6922 2.1509 1.1541 1.1160 1.0515 1.0729 1.1623 1.0539 1.1769 1.1115 1.1351 1.0933 1.0573 1.0983 7.8837 7.1072 9.3607 1.0486 1.0400 1.1059 1.0824 1.0402 1.0385 1.0427 1.0551 1.1026 1.0597 1.0996 1.0943 1.0957 1.1003 1.1023 1.0988 1.0997 1.0972 1.0985 1.0917
irintensity: 0.2996 0.9145 0.5969 6.8697 4.0445 0.0833 0.9071 1.1716 1.6291 2.1585 1.5280 1.0031 2.5831 2.4472 4.0576 8.9482 2.0349 0.3050 0.4587 0.2843 0.0883 2.8018 2.6871 8.9863 3.0229 2.3578 3.1684 4.2840 5.1146 0.2550 1.4527 0.6312 1.4092 4.1161 5.6857 35.3138 7.0508 6.7428 15.3518 22.7373 7.3787 10.1494 13.4428 4.7964 10.5686 42.3951 128.8167 3.4324 1.6976 1.2137 7.4440 19.2741 5.1527 4.5675 1.3717 16.5636 18.6628 13.6123 1.3655 0.3426 2.2741 12.0988 25.0939 23.7601 2.2215 26.6846 9.4854 45.0311 31.1632 9.9815 1.0608 37.3078 12.4219 16.4045 11.0100 7.7011 20.6783 9.6777 28.6362 2.6187 11.8706 17.6392 14.7447 249.5647 72.9235 51.0083 94.5096 52.7106 8.8895 25.3276 28.4597 17.1038 47.1258 68.2245 26.8798 16.9000 18.0792 17.7378 39.6800 25.4507 14.1598 16.0101 34.5169 0.9656 19.4989
temp: 298.150 k
press: 1.00000 atm
elementType: 8 8 6 6 6 6 6 6 6 6 6 6 6 6 6 6 6 1 1 1 1 1 1 1 1 1 1 1 1 1 1 1 1 1 1 1 1
symmnumber: 1
zpe: 819594.0 jmol-1
zpe.correction: 0.312167 hartree
zpe.thermalcorrener: 0.330209 hartree
zpe.thermalcorrenthalpy: 0.331154 hartree
zpe.thermalcorrgfe: 0.265760 hartree
zpe.sumelectzpe: -732.760916 hartree
zpe.sumelectthermal: -732.742874 hartree
zpe.sumelectthermalent: -732.741929 hartree
zpe.sumelectthermalfe: -732.807323 hartree
dipole: 1.1908 3.4538 1.8186
dipole: 4.0809
quadrupole: -97.8003 -104.3285 -100.9733
quadrupole: -9.7131 4.6621 -1.1092
quadrupole: 3.2338 -3.2945 0.0607 -9.7131 4.6621 -1.1092
hfenergy: -733.0730828 hartree
pointgroup: C01 [X(C15H20O2)]
dipole: -0.4581618 1.3574459 -0.7247395 debye
polarizability: 231.3764056|-8.2594832|178.1090469|-9.3851337|-5.7849162|108.3806633 unknown
InChI: InChI=1S/C15H20O2/c1-9-7-12-8-10(2)15(16)14(12)11(3)13(9)5-6-17-4/h7,10H,5-6,8H2,1-4H3
charge 0 multiplicity 1
37 atoms
O  2.6254 -2.343381 0.092091
O  -4.68317 -0.683405 0.000097
C  3.620741 -0.183448 -0.623185
C  3.065387 1.263626 -0.498137
C  1.586742 1.086857 -0.180066
C  1.258618 -0.271943 0.072782
C  2.482114 -1.10248 -0.107988
C  -0.065084 -0.665961 0.427524
C  -1.067853 0.346746 0.50477
C  0.595482 2.076683 -0.092847
C  -0.734011 1.718408 0.247166
C  4.957621 -0.451633 0.097811
C  -2.507614 -0.031984 0.832396
C  -0.386486 -2.121353 0.725253
C  -1.78196 2.814209 0.354186
C  -3.321565 -0.360343 -0.435212
C  -5.554009 -1.030125 -1.120944
H  3.746516 -0.436932 -1.69687
H  3.224227 1.862198 -1.413816
H  3.574497 1.802571 0.325296
H  0.840143 3.128843 -0.281111
H  5.206267 -1.525912 0.045769
H  5.780212 0.125345 -0.362068
H  4.892526 -0.169081 1.164772
H  -3.027384 0.78522 1.361971
H  -2.54646 -0.913619 1.494969
H  -0.640803 -2.254893 1.795053
H  -1.257338 -2.475714 0.144521
H  0.478153 -2.764486 0.504296
H  -2.147286 2.923336 1.393506
H  -1.366749 3.78749 0.043217
H  -2.667985 2.608062 -0.273824
H  -2.875306 -1.223326 -0.97831
H  -3.33778 0.507638 -1.132687
H  -5.180338 -1.923178 -1.666572
H  -5.648112 -0.188134 -1.840407
H  -6.542354 -1.253401 -0.689301
