program: Gaussian 09
title: 000135294
version: EM64L-G09RevD.01
frameworkgroup: C1[X(C21H17N3)]
method: RPBEPBE
basis: SDD
operation: Freq
keyword: #pfreq=noraman
keyword: PBEPBE/SDD
title: #p freq=noraman PBEPBE/SDD
converged: YES YES NO NO
title: Mulliken charges:
elementType: N N N C C C C C C C C C C C C C C C C C C C C C H H H H H H H H H H H H H H H H H
charge: -0.445953 -0.123761 -0.049002 0.200615 0.340887 0.173391 0.356330 0.315116 -0.062363 0.337336 -0.381937 -0.411344 -0.401813 -0.393488 -0.369152 -0.410321 -0.797150 -0.259019 -0.227787 -0.396421 -0.396134 -0.237679 -0.237306 -0.242432 0.260995 0.264132 0.237605 0.237385 0.218421 0.335242 0.234574 0.212419 0.257559 0.239312 0.232937 0.232208 0.238828 0.238670 0.225010 0.224984 0.229106
chargesum: 0.00000
title: Mulliken charges with hydrogens summed into heavy atoms:
elementType: N N N C C C C C C C C C C C C C C C C C C C C C
charge: -0.110711 -0.123761 -0.049002 0.200615 0.340887 0.173391 0.356330 0.315116 -0.062363 0.337336 -0.120942 -0.147212 -0.164208 -0.156103 -0.150731 -0.175746 -0.087860 -0.026083 0.004421 -0.157593 -0.157464 -0.012669 -0.012322 -0.013326
polarizability: 4.97440678e+02 -8.81441905e+00 2.28835486e+02 -1.09572781e+01 -7.00366245e+00 1.19503750e+02
1716.lowfreq: -4.9468 -0.0009 -0.0006 0.0001 2.3815 8.8525 23.8744 30.7109 40.5080
frequency: 23.7439 30.1673 40.4790 49.9649 73.6637 92.8770 98.9005 131.0847 140.6723 155.8713 180.8356 201.1689 237.4921 294.2631 308.4348 328.8953 352.7451 405.2413 406.0105 413.1777 445.3293 452.4444 457.5951 485.6569 508.8783 532.1497 557.8338 559.3364 613.9855 635.9270 646.4402 665.5987 672.1368 694.6976 701.7575 721.9272 733.1502 750.8692 753.2906 773.9865 780.5701 796.3668 850.1918 854.6384 862.8464 871.6428 920.9237 930.7514 949.1175 965.1753 974.1245 981.2166 986.1952 990.4064 990.5684 993.7124 994.8143 996.3991 1013.3209 1039.0745 1048.4320 1052.3142 1067.0977 1080.6146 1085.2231 1115.8277 1133.3387 1152.8532 1173.3156 1178.9101 1189.8747 1201.7253 1211.9243 1233.7277 1270.6333 1290.7458 1296.0431 1306.1835 1320.5392 1348.3788 1362.1734 1373.8095 1376.2254 1407.6277 1420.5333 1423.0363 1431.4916 1439.8582 1455.1837 1469.5496 1473.4007 1484.8227 1527.6679 1546.8573 1564.8691 1580.6060 1587.7053 1612.0274 1614.6386 1626.4200 2991.7504 3076.5404 3092.7289 3118.5949 3122.0284 3126.5693 3127.6113 3134.1343 3135.1286 3141.1500 3144.6031 3148.5504 3159.6650 3164.2155 3165.2368 3165.4357 3610.3602
redmass: 4.5140 3.9836 5.6143 5.4831 3.8757 4.7871 5.0472 2.7820 1.2912 4.4141 6.6178 3.7687 4.9986 5.0728 4.1792 5.3170 4.6852 2.8490 4.5096 3.1696 4.8930 3.0948 5.2272 3.9238 3.9493 4.1942 2.7922 5.4069 6.5148 6.9147 6.6151 2.1664 4.1264 2.0249 1.7523 4.8271 1.9598 2.4278 6.0422 1.8947 2.6084 4.8815 1.2508 1.2778 1.6214 1.3266 1.4602 9.4632 1.3821 7.2022 1.4442 1.3795 2.3169 1.9607 1.3684 1.3142 1.6195 6.6475 3.2320 2.0147 1.5730 2.3485 3.5424 3.0797 1.6259 1.6005 2.0740 2.6893 1.0527 1.0757 1.1126 1.1356 2.9195 4.0860 2.4097 2.8044 1.9029 1.5099 1.4652 1.8666 3.4288 5.0304 9.3282 1.2884 3.6009 1.8588 3.2358 2.4868 1.0564 1.1769 2.5658 2.5086 3.9896 4.6592 6.3793 6.7007 6.4848 6.0069 6.0574 6.3307 1.0365 1.0961 1.1013 1.0870 1.0844 1.0874 1.0882 1.0879 1.0886 1.0914 1.0934 1.0962 1.0954 1.0998 1.1007 1.0982 1.0825
irintensity: 0.1716 0.2752 0.3092 0.9505 0.1261 1.1486 0.4510 1.3686 0.4508 1.1556 0.3368 2.2467 2.3526 0.7931 0.2630 1.1005 5.1031 0.2780 1.9038 0.1408 6.1973 7.8569 1.6648 6.3404 6.2756 0.5532 4.7810 1.9495 0.0069 0.3703 3.4519 51.4485 13.0580 24.2381 48.5017 2.1678 32.9589 102.5435 8.0692 22.3120 34.3323 1.8418 0.1576 4.3897 44.1684 0.5783 1.8212 4.4800 0.5670 17.7210 0.3962 1.4605 0.9125 0.2889 0.0281 0.0861 1.6032 9.7850 2.9548 8.5084 10.3529 8.3869 2.5363 23.1763 8.8118 20.2847 11.7595 4.4276 0.0183 1.5759 1.5943 14.1863 3.6646 9.0749 6.3572 1.3277 1.7438 1.4548 4.3824 9.5824 9.5914 0.6499 1.3566 11.7333 24.1178 6.0405 204.8790 9.9136 15.4690 37.6091 54.8838 6.9574 22.1084 6.0303 0.9884 0.9970 1.3193 8.2261 4.1880 8.4265 17.9202 9.7036 29.7285 14.1436 9.6579 1.6050 2.6236 6.9389 23.8474 6.9552 27.6671 40.2094 12.4137 22.6192 40.9876 5.9105 64.4235
temp: 298.150 k
press: 1.00000 atm
elementType: 7 7 7 6 6 6 6 6 6 6 6 6 6 6 6 6 6 6 6 6 6 6 6 6 1 1 1 1 1 1 1 1 1 1 1 1 1 1 1 1 1
symmnumber: 1
zpe: 850731.8 jmol-1
zpe.correction: 0.324027 hartree
zpe.thermalcorrener: 0.343352 hartree
zpe.thermalcorrenthalpy: 0.344297 hartree
zpe.thermalcorrgfe: 0.274314 hartree
zpe.sumelectzpe: -973.068474 hartree
zpe.sumelectthermal: -973.049148 hartree
zpe.sumelectthermalent: -973.048204 hartree
zpe.sumelectthermalfe: -973.118187 hartree
dipole: 2.6547 -0.2211 0.2171
dipole: 2.6728
quadrupole: -102.8327 -126.7050 -144.8523
quadrupole: -4.8901 -1.2450 -1.6984
quadrupole: 21.9639 -1.9083 -20.0556 -4.8901 -1.2450 -1.6984
hfenergy: -973.3925006 hartree
pointgroup: C01 [X(C21H17N3)]
dipole: 1.0448474 0.0512897 -0.10678 debye
polarizability: 497.4761112|11.1224067|212.8818983|8.1704621|-39.156506|135.421905 unknown
InChI: InChI=1S/C21H17N3/c1-15-7-5-6-10-19(15)21-22-20(23-24-21)18-13-11-17(12-14-18)16-8-3-2-4-9-16/h2-14,24H,1H3
charge 0 multiplicity 1
41 atoms
N  2.817496 1.792502 -0.74366
N  1.895511 -0.081977 0.020671
N  1.452011 2.025267 -0.847656
C  4.449846 0.032017 0.017197
C  -0.515886 0.605092 -0.263836
C  3.086058 0.530397 -0.222359
C  -3.328998 0.103639 -0.060619
C  4.752974 -1.367979 0.052195
C  0.928097 0.850988 -0.363784
C  -4.792694 -0.156416 0.044735
C  -1.456224 1.590434 -0.667139
C  -0.994253 -0.631603 0.242773
C  -2.836001 1.340743 -0.565321
C  -2.376482 -0.874812 0.340336
C  5.493314 0.983019 0.210686
C  6.102821 -1.749085 0.262804
C  3.698915 -2.442778 -0.129029
C  6.825471 0.578166 0.416714
C  7.133381 -0.800794 0.439856
C  -5.319177 -0.97232 1.085153
C  -5.706199 0.403598 -0.891967
C  -6.704686 -1.219516 1.185383
C  -7.092149 0.158634 -0.792287
C  -7.600114 -0.655012 0.247185
H  -1.09133 2.549509 -1.048596
H  -0.266925 -1.390983 0.546272
H  -3.543925 2.126675 -0.851124
H  -2.723924 -1.848126 0.704398
H  5.255659 2.053495 0.239822
H  3.466335 2.49938 -1.082461
H  6.344456 -2.818103 0.285992
H  4.169754 -3.43847 -0.196381
H  2.981712 -2.4404 0.709977
H  3.09102 -2.27257 -1.035095
H  7.609967 1.3266 0.570078
H  8.164145 -1.134828 0.6010
H  -4.641805 -1.389782 1.838769
H  -5.325169 1.009215 -1.722185
H  -7.086915 -1.843843 2.000942
H  -7.774738 0.594033 -1.530895
H  -8.676149 -0.846003 0.324955
