program: Gaussian 09
title: 000135284
version: EM64L-G09RevD.01
frameworkgroup: C1[X(C20H28O2)]
method: RPBEPBE
basis: SDD
operation: Freq
keyword: #pfreq=noraman
keyword: PBEPBE/SDD
title: #p freq=noraman PBEPBE/SDD
converged: YES YES NO NO
title: Mulliken charges:
elementType: O O C C C C C C C C C C C C C C C C C C C C H H H H H H H H H H H H H H H H H H H H H H H H H H H H
charge: -0.440731 -0.276593 0.201495 -0.440975 -0.452407 0.263624 -0.505902 0.200827 -0.762806 -0.747844 -0.342308 -0.841213 -0.335925 0.397603 -0.831925 -0.352352 -0.218523 -0.317576 0.453450 -0.846613 -0.435152 0.143064 0.202188 0.199783 0.207573 0.207335 0.218702 0.218622 0.226087 0.205236 0.220628 0.211560 0.228996 0.224095 0.224298 0.259188 0.223476 0.226114 0.237934 0.237204 0.229679 0.232755 0.216654 0.234737 0.223505 0.226734 0.304648 0.227114 0.241790 0.372147
chargesum: 0.00000
title: Mulliken charges with hydrogens summed into heavy atoms:
elementType: O O C C C C C C C C C C C C C C C C C C C C
charge: -0.068584 -0.276593 0.201495 -0.039003 -0.037500 0.263624 -0.068579 0.200827 -0.110855 -0.083192 -0.118010 -0.132435 -0.097991 0.397603 -0.132287 -0.135698 0.016213 -0.094072 0.453450 -0.088117 -0.193362 0.143064
polarizability: 7.22155047e+02 1.45608419e+01 2.25469590e+02 2.48805500e+01 6.53801566e+00 1.45107869e+02
1716.lowfreq: -14.6486 -5.0435 -0.0011 -0.0006 0.0014 3.1018 19.0388 24.5652 27.2574
frequency: 18.9066 24.2416 26.7833 49.2350 52.7456 70.2321 85.0744 103.1140 118.2535 131.5818 147.9195 148.4276 156.3360 170.3252 194.0573 210.5503 227.1308 245.5205 247.1910 262.2396 269.4164 271.7464 287.0333 307.4586 341.0206 344.9444 359.0736 366.5162 371.8495 393.8787 411.0915 418.3079 465.9473 474.3867 497.3255 525.8492 543.0326 561.0664 566.1006 574.6574 597.8088 651.7204 662.2727 694.8803 718.8540 788.5460 829.8317 842.6162 844.4358 855.4257 867.0528 879.2531 898.3195 902.8562 910.5579 925.3167 935.6463 937.0998 964.1831 977.6572 981.9591 987.4107 1002.9078 1010.7197 1024.0229 1032.5080 1038.1266 1045.1416 1047.0201 1060.6179 1081.8754 1123.3253 1139.0542 1171.5128 1191.0052 1195.2735 1198.0183 1210.5769 1215.4702 1226.2329 1261.5809 1269.8137 1276.9172 1296.8551 1302.5737 1320.5694 1334.0272 1339.8544 1341.9568 1355.8629 1370.8161 1380.9556 1386.7067 1388.9369 1394.5302 1401.1391 1405.7936 1445.8416 1455.7636 1462.8270 1465.5318 1465.8780 1469.4164 1471.6169 1471.9720 1473.5740 1474.5081 1484.4939 1489.4528 1495.6850 1560.6665 1562.8854 1606.1518 1609.1470 1621.0029 1630.9836 2935.4423 2956.2275 2964.2456 2969.0936 2973.8042 2979.2095 2980.1926 2980.4487 2994.4632 3023.9790 3025.6876 3045.6122 3051.1782 3055.3105 3062.0594 3066.8918 3072.0129 3076.5517 3076.8300 3087.1468 3089.7108 3105.9099 3107.8734 3118.4586 3122.9701 3125.6238 3142.6758 3524.7729
redmass: 4.4003 4.2959 4.2680 3.9389 3.5658 4.8127 3.8996 3.2624 2.5857 2.3127 1.9004 1.0998 1.6104 3.4301 2.1346 1.4856 1.8315 1.8886 1.3335 2.4022 2.1333 2.2420 2.1232 2.4139 2.8220 2.6736 2.5383 2.5646 3.1034 2.7168 4.0605 2.8485 3.4079 3.0222 3.0643 3.0870 2.3476 3.5944 2.5371 1.1641 3.4913 3.9105 3.9183 3.8724 2.9242 2.5898 3.3982 1.5637 1.5517 2.7470 2.0658 2.2783 1.7812 1.7886 1.6867 1.5168 6.3409 1.9947 1.1485 1.3220 1.2446 1.5847 1.3435 1.6290 1.8889 1.8301 1.5044 1.6274 1.5308 1.7685 1.6193 1.6027 2.8907 2.1615 2.3381 2.1492 2.2375 2.0503 1.4027 1.7045 1.6833 1.3321 1.5214 2.5442 1.4555 1.6222 1.7016 1.5937 1.6945 2.0953 1.1855 1.5769 1.3186 1.2059 1.2166 1.4176 1.5990 1.1056 1.0688 1.0567 1.1138 1.0889 1.0784 1.0636 1.0530 1.0737 1.1284 1.0607 1.0601 1.0481 4.8063 4.0068 5.4574 5.8410 5.5330 6.0186 1.0630 1.0404 1.0585 1.0358 1.0368 1.0808 1.0397 1.0392 1.0758 1.0950 1.0984 1.1030 1.0968 1.0964 1.0992 1.0987 1.0996 1.0887 1.0995 1.0903 1.0966 1.0897 1.0951 1.0857 1.0963 1.0890 1.0898 1.0640
irintensity: 0.0314 0.2073 0.1166 0.1300 0.3083 1.5302 0.9747 0.3196 0.7012 0.1453 0.2975 1.3266 0.8445 0.2192 0.9515 0.3506 0.2250 0.0906 0.5441 7.2292 0.9851 1.1941 3.2948 0.0477 1.0515 2.6784 1.6492 0.9996 10.0966 10.9188 12.1978 0.8917 11.7457 3.4318 7.3863 5.1017 1.0274 16.9817 5.3034 142.9409 5.0799 4.4536 6.0373 25.1251 14.1274 8.6017 14.7877 4.9861 11.7747 2.6260 7.0959 0.8909 1.5169 13.2177 6.4656 0.7337 149.2709 1.0836 7.4498 34.3416 83.1859 17.9358 2.9786 34.6035 118.4892 133.8577 2.5056 30.8388 1.9491 734.0965 1.9699 3.4995 0.1684 48.1300 15.5053 4.8019 17.9476 3.3929 8.9189 36.3072 9.2028 66.6281 39.1966 27.6919 1.3838 11.5410 10.3580 9.2257 1.4977 22.8120 19.2960 103.8238 26.7842 17.2629 10.0773 42.8925 72.7763 28.7074 5.1463 5.8703 200.2252 32.9602 25.4993 7.3635 25.3660 15.8726 43.2135 12.0385 9.7161 18.6615 176.5016 958.6717 204.4944 117.0518 185.8941 216.6884 42.8216 48.7256 39.5965 23.3246 46.2022 20.1419 27.7592 20.1877 59.8292 35.2205 71.3092 68.5070 15.8767 18.2741 8.4166 124.8554 28.6137 7.3913 39.8499 11.9168 21.5214 4.7152 12.9748 29.0079 11.6835 27.4643 8.7055 84.7623
temp: 298.150 k
press: 1.00000 atm
elementType: 8 8 6 6 6 6 6 6 6 6 6 6 6 6 6 6 6 6 6 6 6 6 1 1 1 1 1 1 1 1 1 1 1 1 1 1 1 1 1 1 1 1 1 1 1 1 1 1 1 1
symmnumber: 1
zpe: 1118319.1 jmol-1
zpe.correction: 0.425945 hartree
zpe.thermalcorrener: 0.450779 hartree
zpe.thermalcorrenthalpy: 0.451723 hartree
zpe.thermalcorrgfe: 0.370074 hartree
zpe.sumelectzpe: -927.665198 hartree
zpe.sumelectthermal: -927.640365 hartree
zpe.sumelectthermalent: -927.639421 hartree
zpe.sumelectthermalfe: -927.721070 hartree
dipole: -6.0070 0.2953 -0.2521
dipole: 6.0195
quadrupole: -154.9628 -127.8654 -137.9059
quadrupole: 3.1648 1.1456 1.3409
quadrupole: -14.7181 12.3793 2.3388 3.1648 1.1456 1.3409
hfenergy: -928.0911437 hartree
pointgroup: C01 [X(C20H28O2)]
dipole: -2.3631943 0.114755 -0.1039072 debye
polarizability: 722.0159058|14.8268563|225.4252021|26.2451533|6.9994577|145.2913982 unknown
InChI: InChI=1S/C20H28O2/c1-15(8-6-9-16(2)14-19(21)22)11-12-18-17(3)10-7-13-20(18,4)5/h6,8-9,11-12,14,21H,7,10,13H2,1-5H3
charge 0 multiplicity 1
50 atoms
O  8.123166 1.757082 0.717467
O  8.134378 -0.470738 0.057727
C  -4.952589 -0.821068 0.403537
C  -6.33375 -0.102753 0.347209
C  -6.253765 1.372676 0.77237
C  -3.81664 0.081001 -0.16593
C  -5.345637 2.123382 -0.21641
C  -4.031529 1.406999 -0.502222
C  -5.090288 -2.132999 -0.428514
C  -4.615417 -1.200689 1.876632
C  -2.515092 -0.590912 -0.324724
C  -3.027801 2.286821 -1.229142
C  -1.261063 -0.039842 -0.148296
C  0.006376 -0.743028 -0.304814
C  -0.009891 -2.200747 -0.729187
C  1.182969 -0.03604 -0.056407
C  2.535704 -0.519172 -0.149418
C  3.643086 0.269379 0.12221
C  5.031284 -0.16397 0.042132
C  5.340149 -1.59215 -0.369958
C  6.013156 0.768992 0.351804
C  7.461187 0.560733 0.340109
H  -7.046619 -0.661944 0.984294
H  -6.724133 -0.149865 -0.690668
H  -5.843309 1.453878 1.797563
H  -7.261176 1.829936 0.791411
H  -5.11372 3.141679 0.160004
H  -5.884482 2.282654 -1.176842
H  -5.168774 -1.914117 -1.509471
H  -4.246007 -2.828421 -0.273161
H  -6.008764 -2.668089 -0.121027
H  -5.36772 -1.907859 2.275488
H  -3.621666 -1.680106 1.94468
H  -4.597668 -0.308923 2.529028
H  -2.557916 -1.664417 -0.552057
H  -2.267759 1.705856 -1.775864
H  -2.496792 2.968145 -0.533208
H  -3.561497 2.936357 -1.950426
H  -1.185744 1.008535 0.16947
H  -0.515067 -2.320641 -1.70604
H  1.000356 -2.627586 -0.819159
H  -0.568869 -2.815714 0.001936
H  1.073363 1.017079 0.24707
H  2.6994 -1.561452 -0.450314
H  3.472924 1.313821 0.424586
H  4.923156 -1.802678 -1.372975
H  6.423557 -1.774011 -0.391859
H  4.873454 -2.306561 0.334485
H  5.709853 1.781735 0.641028
H  9.102728 1.582852 0.699452
