program: Gaussian 09
title: 000135274
version: EM64L-G09RevD.01
frameworkgroup: C1[X(C11H22I2O4)]
method: RPBEPBE
basis: SDD
operation: Freq
keyword: #p
keyword: freq=noraman
keyword: PBEPBE/SDD
title: #p freq=noraman PBEPBE/SDD
converged: YES YES NO NO
title: Mulliken charges:
elementType: I I O O O O C C C C C C C C C C C H H H H H H H H H H H H H H H H H H H H H H
charge: 0.046602 0.026655 -0.311953 -0.300530 -0.422305 -0.446333 -0.342103 -0.401835 -0.399920 -0.252399 -0.253762 -0.278147 -0.251964 -0.037742 -0.039409 -0.771328 -0.783364 0.240100 0.175970 0.193624 0.211866 0.214724 0.189432 0.205473 0.184997 0.201240 0.184237 0.221369 0.197721 0.196101 0.226798 0.247399 0.239163 0.302352 0.277142 0.291356 0.313593 0.349116 0.356064
chargesum: 0.00000
title: Mulliken charges with hydrogens summed into heavy atoms:
elementType: I I O O O O C C C C C C C C C C C
charge: 0.046602 0.026655 -0.311953 -0.300530 -0.073189 -0.090269 0.073968 0.003655 0.004236 0.138071 0.131715 0.140943 0.170934 0.209657 0.199753 -0.191834 -0.178415
polarizability: 1.85463739e+02 3.37906320e+01 2.16592618e+02 -2.26348656e+00 1.00001903e+01 1.31110238e+02
1716.lowfreq: -15.0697 -11.1155 -5.0805 -1.8296 -0.0002 0.0001 0.0004 8.4682 9.6225
frequency: -12.1737 -4.6540 9.1292 15.2152 28.5973 43.7588 53.3779 59.8727 97.6165 100.1058 115.0548 125.9910 143.8388 145.6423 157.4502 177.2052 194.8371 218.8700 237.0579 257.2001 308.5080 339.4976 357.0097 383.4019 407.5187 423.0572 447.3279 456.4547 501.5679 529.5603 540.0015 602.5467 662.6107 732.8724 784.9789 795.7096 809.6753 844.1814 859.1109 879.1925 890.5855 919.8696 924.7084 944.8413 977.5442 982.2132 1002.7727 1028.8430 1034.7735 1053.6392 1076.0732 1081.7956 1089.5400 1094.3250 1103.2188 1122.7623 1126.0934 1138.6324 1167.4841 1182.7813 1195.3892 1203.0844 1207.4872 1211.2408 1222.3338 1241.7342 1257.6599 1277.2330 1281.6186 1290.4583 1318.8327 1327.8115 1333.2630 1338.8746 1348.7039 1364.8271 1367.9991 1377.8027 1390.8791 1399.7136 1421.6514 1431.8697 1449.7881 1454.1411 1461.6879 1471.9284 1481.7002 1483.7877 1486.3397 2916.8939 2926.2887 2941.3468 2944.7904 2964.0670 2967.1966 2971.0141 2983.6074 2988.0660 2988.7255 3003.5007 3010.2297 3031.2784 3035.9755 3048.8234 3057.3747 3059.6420 3071.2783 3137.6032 3152.7895 3506.6780 3523.0792
redmass: 8.0384 4.6238 29.5432 13.5315 4.1245 5.7871 3.4125 3.3374 3.5165 2.5294 4.5491 4.7186 5.0713 4.4854 3.4014 3.0905 2.3406 3.8005 3.0228 3.2369 2.4908 2.7824 1.0872 3.4671 3.4444 2.4212 2.4679 1.4217 2.4657 3.5160 2.9825 3.4549 3.3271 1.2155 1.7738 2.3437 2.1101 2.2455 1.8499 1.7453 2.2226 2.0339 2.3289 1.9711 2.0590 2.0792 2.5238 2.3848 2.2269 3.4346 3.0941 1.5793 2.4557 2.6134 2.3620 1.6153 1.7298 1.3913 1.2931 1.2600 1.1917 1.1969 1.2307 1.2220 1.2197 1.2144 1.4651 1.2235 1.2386 1.0816 1.1953 1.3600 1.2593 1.2865 1.4219 1.5942 1.4546 1.1876 1.3591 1.4983 1.1431 1.1136 1.0899 1.0727 1.0839 1.0841 1.0866 1.0857 1.0772 1.0563 1.0555 1.0571 1.0547 1.0676 1.0907 1.0784 1.0774 1.0855 1.0870 1.1075 1.1028 1.0945 1.1005 1.0576 1.0561 1.0863 1.0987 1.1085 1.1102 1.0648 1.0656
irintensity: 0.5244 0.7458 0.0376 0.2145 1.4681 0.0337 0.1826 1.2329 1.6497 5.5720 0.8897 3.7966 5.4935 9.6291 1.0990 9.6514 0.5557 2.2576 0.4671 3.3015 2.2159 7.3230 158.3242 12.0245 25.5769 1.3455 18.5191 121.3716 17.5064 30.7486 2.6994 21.0242 4.0734 3.9905 5.1185 4.1719 2.7551 20.8517 3.7452 15.3213 19.2205 12.4573 8.6924 20.3053 39.5537 56.4057 35.4403 33.0265 41.7032 32.7211 147.4294 40.6660 53.3896 38.5271 4.3175 6.9647 12.9709 17.8873 1.1729 10.8482 11.0423 70.0101 2.1634 21.6329 7.8309 23.7789 34.0302 1.5756 4.9751 5.3454 11.9220 6.9371 20.7007 5.7549 0.2229 4.5754 20.7565 28.4796 3.6162 0.8494 12.4701 9.8072 1.5694 10.2839 11.1857 9.5280 17.3458 4.7227 5.8859 57.1727 46.6877 65.4025 75.2284 20.6270 23.9212 10.2006 59.8600 132.2896 15.8584 34.6995 56.8384 46.1913 4.7799 16.2316 6.7195 22.1148 68.5215 6.3276 2.3887 15.0045 5.7578
temp: 298.150 k
press: 1.00000 atm
elementType: 53 53 8 8 8 8 6 6 6 6 6 6 6 6 6 6 6 1 1 1 1 1 1 1 1 1 1 1 1 1 1 1 1 1 1 1 1 1 1
symmnumber: 1
zpe: 844074.2 jmol-1
zpe.correction: 0.321491 hartree
zpe.thermalcorrener: 0.341953 hartree
zpe.thermalcorrenthalpy: 0.342897 hartree
zpe.thermalcorrgfe: 0.265937 hartree
zpe.sumelectzpe: -754.819186 hartree
zpe.sumelectthermal: -754.798724 hartree
zpe.sumelectthermalent: -754.797780 hartree
zpe.sumelectthermalfe: -754.874740 hartree
dipole: 3.5765 4.9357 2.8914
dipole: 6.7463
quadrupole: -148.0785 -117.7858 -130.2700
quadrupole: 8.8514 -8.2455 6.7000
quadrupole: -16.0337 14.2589 1.7748 8.8514 -8.2455 6.7000
hfenergy: -755.1406764 hartree
pointgroup: C01 [X(C11H22I2O4)]
dipole: -0.2317507 2.3109743 -1.2846965 debye
polarizability: 166.1268345|-7.6631285|236.1959813|0.0850135|-13.5775602|130.8437795 unknown
InChI: InChI=1S/C11H22I2O4/c12-6-10(14)8-16-4-2-1-3-5-17-9-11(15)7-13/h10-11,14-15H,1-9H2
charge 0 multiplicity 1
39 atoms
I  2.445732 -4.004762 1.221506
I  -2.070072 -3.453603 -0.786378
O  2.60139 0.804771 -0.101272
O  -2.449351 1.279465 0.33784
O  4.109621 -0.976952 1.419183
O  -4.888328 -1.374672 -0.28137
C  0.12817 2.528758 -0.261129
C  1.546091 2.978638 0.151443
C  -0.983402 3.190618 0.581948
C  2.652378 2.201649 -0.570158
C  -2.390353 2.73886 0.172599
C  3.557559 -0.075211 -0.788642
C  -3.73594 0.700091 -0.047348
C  3.661045 -1.350622 0.078306
C  -3.563881 -0.828062 0.024719
C  2.323504 -2.112317 0.085348
C  -2.493208 -1.279333 -0.975646
H  0.052217 1.432399 -0.154616
H  -0.034414 2.761103 -1.335155
H  1.682448 4.059111 -0.05861
H  1.681259 2.845084 1.243123
H  -0.830964 2.947278 1.651558
H  -0.931945 4.295029 0.489851
H  3.655864 2.624212 -0.344923
H  2.50019 2.229171 -1.672128
H  -3.164368 3.221984 0.808632
H  -2.598193 3.001606 -0.889905
H  4.558173 0.404287 -0.833328
H  3.212233 -0.298705 -1.820619
H  -4.023139 1.005517 -1.077576
H  -4.543158 1.006358 0.649772
H  4.459152 -1.997332 -0.32555
H  -3.246222 -1.098945 1.052412
H  1.519492 -1.532559 0.563165
H  2.021451 -2.419945 -0.928774
H  -2.825822 -1.147021 -2.016933
H  -1.53303 -0.778448 -0.786638
H  3.528623 -0.222983 1.708978
H  -4.835698 -2.365618 -0.240085
