program: Gaussian 09
title: 000135221
version: EM64L-G09RevD.01
frameworkgroup: C1[X(C20H23NO5)]
method: RPBEPBE
basis: SDD
operation: Freq
keyword: #p
keyword: freq=noraman
keyword: PBEPBE/SDD
title: #p freq=noraman PBEPBE/SDD
converged: YES YES NO NO
title: Mulliken charges:
elementType: O O O O O N C C C C C C C C C C C C C C C C C C C C H H H H H H H H H H H H H H H H H H H H H H H
charge: -0.292947 -0.313387 -0.302975 -0.435689 -0.487699 -0.124730 -0.158454 -0.590034 -0.383858 -0.482705 0.339788 -0.560705 0.441309 0.117762 0.315765 -0.509435 0.061136 -0.632955 -0.552857 0.019363 0.261677 0.111729 0.149925 -0.522665 -0.525485 -0.527241 0.207343 0.216713 0.249960 0.195007 0.215341 0.247762 0.207493 0.205022 0.233066 0.254817 0.259845 0.228827 0.382364 0.371062 0.225324 0.265525 0.212889 0.229750 0.255044 0.223954 0.220131 0.251502 0.226624
chargesum: 0.00000
title: Mulliken charges with hydrogens summed into heavy atoms:
elementType: O O O O O N C C C C C C C C C C C C C C C C C C C C
charge: -0.292947 -0.313387 -0.302975 -0.053324 -0.116637 -0.124730 0.048889 -0.123361 0.026490 -0.027449 0.339788 -0.122617 0.441309 0.117762 0.315765 -0.254618 0.061136 -0.373110 -0.324030 0.019363 0.261677 0.111729 0.149925 0.181072 0.183263 0.171016
polarizability: 3.45836583e+02 -4.63713694e+00 2.51243337e+02 -9.44597238e+00 -5.95307213e+00 1.44978382e+02
1716.lowfreq: -8.8754 -4.7755 -2.5340 -0.0007 -0.0005 0.0004 26.3320 32.9665 56.1181
frequency: 26.1810 32.9067 56.0837 60.1320 73.9131 80.5841 89.6623 102.1862 116.9335 132.6573 146.9659 158.9868 168.6256 169.9228 178.3374 193.4332 217.6181 243.4791 249.3750 257.9069 258.9452 269.0693 277.9471 282.2553 297.6229 328.5822 356.8146 375.8099 382.4193 402.2285 416.8062 429.3127 440.9382 473.6053 486.1361 497.4612 507.3700 512.9887 545.4992 562.6121 601.3003 617.9728 649.7629 657.2712 669.8477 706.4920 717.0427 727.2455 744.9297 770.2986 778.2771 818.2944 831.8745 857.6619 871.8758 877.4570 885.5567 903.1507 922.8091 963.8696 973.7678 979.8477 1006.9396 1030.2025 1050.2884 1066.1262 1071.7057 1087.1004 1110.0391 1110.8482 1113.5723 1117.5326 1145.6592 1150.5195 1153.2140 1154.6118 1156.9521 1169.0421 1185.0220 1189.1202 1193.1245 1199.1641 1208.4584 1223.6034 1237.1104 1255.7661 1272.3721 1276.1560 1302.3846 1308.2809 1318.8359 1332.4565 1342.1043 1353.6919 1365.5851 1386.2446 1401.6802 1409.6893 1417.5351 1431.7228 1438.4815 1440.6894 1442.8532 1450.9764 1452.2056 1454.8055 1457.3203 1458.6794 1469.0559 1476.8801 1479.6665 1484.3612 1487.8118 1515.5802 1576.3733 1605.9113 1612.3400 1634.6772 2798.8972 2823.1805 2850.9503 2969.1344 2973.6540 2975.1354 2976.1116 2986.1144 3021.4951 3027.6425 3031.7793 3044.7938 3066.9058 3075.2215 3081.2816 3104.8720 3117.5535 3117.9227 3124.6101 3146.8547 3154.4823 3531.6126 3623.0579
redmass: 4.6391 4.4001 3.4008 3.7824 2.7276 2.9209 3.0746 3.1450 3.6370 1.7536 2.1404 1.2069 2.0308 1.6015 3.6974 2.8937 3.4055 3.7907 4.5684 2.4777 1.5765 2.5416 4.3515 3.1272 6.2912 4.1596 4.3219 4.7385 4.1405 5.5978 5.7176 3.4568 3.9576 1.1188 3.9057 3.3758 4.5331 4.8971 4.7107 4.2706 4.8757 4.6201 5.7613 5.8897 4.6112 4.4495 3.7808 3.9135 3.1740 4.9033 5.1310 4.8940 1.4890 2.1050 4.3638 1.5650 2.1173 2.3819 6.1012 3.0370 3.2973 2.4141 2.3508 3.2227 4.8463 2.7491 2.8384 3.6897 1.2499 1.2482 1.2406 2.3389 1.6657 1.3595 1.6064 1.9579 1.4416 1.4063 1.4421 1.6045 1.5801 1.5783 2.1222 1.2782 1.7642 1.7345 1.7437 1.6954 1.8973 2.1520 1.4902 1.9203 1.9040 2.4317 3.5948 1.8137 1.9001 4.8856 1.2607 1.2877 1.3180 1.5371 1.4500 1.5525 1.2777 1.1187 1.0679 1.0692 2.0108 1.0552 1.1485 1.0539 1.0587 3.6195 7.8643 8.0007 7.3938 7.1098 1.0795 1.0715 1.0708 1.0311 1.0332 1.0304 1.0597 1.0602 1.0853 1.0884 1.1004 1.1000 1.1033 1.1051 1.0983 1.0910 1.1033 1.1027 1.1048 1.0918 1.0909 1.0649 1.0665
irintensity: 0.9472 1.4594 1.4633 0.3158 4.6558 3.7346 6.7209 1.6066 0.6467 0.9061 2.3897 0.1118 4.1179 2.0521 3.2639 1.5563 6.3934 19.7633 13.9120 56.9589 65.5847 19.8468 8.6186 20.5501 6.6328 2.3436 8.4349 1.7329 2.6230 5.2308 1.8378 8.5822 10.7858 119.1554 6.1357 4.1349 1.6088 11.6633 3.7258 4.5446 2.8218 30.0729 5.5677 1.4607 9.8778 4.0915 1.5988 2.2826 6.6271 18.1196 22.6512 13.1759 18.2720 10.9626 11.6388 21.3987 13.8693 13.1706 54.4351 87.2955 58.1186 14.0942 21.3391 46.4197 107.1292 45.9029 75.0626 22.5866 3.1814 8.1590 6.8533 151.5647 16.1287 2.1382 2.8946 26.4060 10.8628 72.0121 14.3644 1.3078 46.3072 16.1604 26.4863 7.9680 41.0406 41.8677 64.0640 107.1520 49.6751 75.9710 42.6593 73.1676 1.8541 12.1699 6.9785 66.7628 9.7187 9.6730 3.2594 31.6729 3.2184 20.1284 33.3944 22.5641 46.6965 8.4039 8.7218 3.2063 42.8539 2.6049 3.4084 22.9466 22.3277 151.7553 40.1129 40.0089 19.4830 4.4170 46.3083 53.3115 139.4130 79.4660 93.2601 61.2480 34.4625 19.3173 8.7482 60.1498 37.8139 18.0325 27.6087 21.9139 36.1966 21.1000 24.4539 30.4596 13.5770 3.6022 4.3485 91.2555 59.5328
temp: 298.150 k
press: 1.00000 atm
elementType: 8 8 8 8 8 7 6 6 6 6 6 6 6 6 6 6 6 6 6 6 6 6 6 6 6 6 1 1 1 1 1 1 1 1 1 1 1 1 1 1 1 1 1 1 1 1 1 1 1
symmnumber: 1
zpe: 1030303.6 jmol-1
zpe.correction: 0.392422 hartree
zpe.thermalcorrener: 0.417682 hartree
zpe.thermalcorrenthalpy: 0.418626 hartree
zpe.thermalcorrgfe: 0.337720 hartree
zpe.sumelectzpe: -1204.812531 hartree
zpe.sumelectthermal: -1204.787272 hartree
zpe.sumelectthermalent: -1204.786328 hartree
zpe.sumelectthermalfe: -1204.867233 hartree
dipole: 0.2521 2.8605 -1.5594
dipole: 3.2677
quadrupole: -111.5502 -150.2925 -152.1269
quadrupole: 11.8467 -6.0784 0.2999
quadrupole: 26.4397 -12.3026 -14.1370 11.8467 -6.0784 0.2999
hfenergy: -1205.2049533 hartree
pointgroup: C01 [X(C20H23N1O5)]
dipole: -0.1043746 -1.0838996 -0.6834178 debye
polarizability: 346.1727802|-4.3293289|249.9560563|5.3036428|12.9315224|145.9294654 unknown
InChI: InChI=1S/C20H23NO5/c1-24-18-8-12-6-15-13-9-17(23)16(22)7-11(13)4-5-21(15)10-14(12)19(25-2)20(18)26-3/h7-9,15,22-23H,4-6,10H2,1-3H3
charge 0 multiplicity 1
49 atoms
O  3.36266 -2.209604 0.313845
O  5.252043 -0.0224 0.133328
O  4.209106 2.639499 -0.260073
O  -5.277054 2.541988 1.123549
O  -6.920428 0.735111 -0.046729
N  -0.775469 -1.518782 -0.28575
C  -1.25531 -0.279038 0.381802
C  -0.448831 0.902146 -0.216032
C  -1.690786 -2.668322 -0.135835
C  0.605628 -1.851541 0.125108
C  -2.76582 -0.074728 0.230662
C  -3.007204 -2.364372 -0.867827
C  1.05075 0.654559 -0.151459
C  1.545675 -0.664679 -0.000972
C  -3.599622 -1.05454 -0.371383
C  -3.344734 1.119303 0.733746
C  2.948201 -0.883118 0.071225
C  1.957549 1.735021 -0.265982
C  -4.993686 -0.811689 -0.480048
C  3.857309 0.205323 -0.003347
C  3.345842 1.517248 -0.207989
C  -4.722984 1.356418 0.623575
C  -5.548792 0.38283 0.00327
C  4.416393 -2.76253 -0.566336
C  5.802569 0.489491 1.412957
C  5.144316 2.647939 -1.408203
H  -1.028091 -0.326605 1.482235
H  -0.690305 1.842554 0.313094
H  -0.769858 1.02862 -1.268134
H  -1.897978 -2.906107 0.939618
H  -1.202389 -3.555265 -0.580762
H  0.975712 -2.681821 -0.50382
H  0.64235 -2.228797 1.181655
H  -3.727043 -3.192292 -0.71716
H  -2.794867 -2.303118 -1.953307
H  -2.734431 1.883266 1.225725
H  1.597652 2.761012 -0.396656
H  -5.638148 -1.57268 -0.940908
H  -6.255722 2.530224 0.954793
H  -7.461792 0.039725 -0.4901
H  4.558307 -3.798793 -0.222568
H  5.349197 -2.183678 -0.472078
H  4.074541 -2.758415 -1.619528
H  5.328183 -0.03125 2.265344
H  5.637792 1.57911 1.491395
H  6.879886 0.263729 1.383182
H  4.578581 2.697233 -2.358329
H  5.788156 1.750297 -1.39831
H  5.749643 3.559319 -1.285784
