program: Gaussian 09
title: 000135196
version: EM64L-G09RevD.01
frameworkgroup: C1[X(C13H22N2)]
method: RPBEPBE
basis: SDD
operation: Freq
keyword: #pfreq=noraman
keyword: PBEPBE/SDD
title: #p freq=noraman PBEPBE/SDD
converged: YES YES NO NO
title: Mulliken charges:
elementType: N N C C C C C C C C C C C C C H H H H H H H H H H H H H H H H H H H H H H
charge: -0.107860 -0.032908 -0.378009 -0.332161 -0.334115 -0.501269 -0.362030 -0.362492 0.194595 -0.685711 -0.685294 -0.355274 -0.179737 -0.363819 -0.188306 0.227849 0.207246 0.182283 0.208150 0.181893 0.199267 0.220730 0.222249 0.213543 0.192257 0.214501 0.192863 0.207524 0.209679 0.217890 0.207898 0.207755 0.218255 0.240151 0.235963 0.236779 0.229663
chargesum: 0.00000
title: Mulliken charges with hydrogens summed into heavy atoms:
elementType: N N C C C C C C C C C C C C C
charge: -0.107860 -0.032908 0.057086 0.058272 0.047045 -0.058290 0.043770 0.044872 0.194595 -0.050617 -0.051385 -0.115123 0.056226 -0.127040 0.041358
polarizability: 1.98389722e+02 5.40911888e+00 1.48983763e+02 -7.97113423e+00 1.48279687e+01 1.19628220e+02
1716.lowfreq: -11.4468 -0.0006 -0.0004 0.0002 0.7355 5.5519 23.5902 27.6103 43.0118
frequency: 23.4610 27.1577 42.8971 59.8669 69.2509 74.2039 78.5929 94.0322 196.6935 208.0946 219.5232 222.3399 233.5378 239.8321 316.5962 333.0649 350.1367 388.9199 404.4385 457.0397 490.2177 526.3739 600.2400 628.0772 744.0550 745.7676 750.5765 765.2647 778.2181 808.8051 844.2466 868.7878 873.0681 895.6220 898.5073 917.3276 954.4421 959.1437 998.4453 1006.1804 1020.0041 1040.2824 1044.4228 1046.6718 1070.1219 1078.5155 1098.8127 1113.3155 1117.3996 1150.0323 1163.4759 1195.1011 1216.5030 1237.5505 1249.9956 1254.3106 1281.9683 1282.7239 1287.3788 1295.2464 1299.2253 1310.7514 1314.1262 1322.2534 1357.0072 1368.6904 1375.7018 1389.3198 1390.5044 1413.7991 1454.2958 1456.9950 1466.3560 1468.1797 1476.5672 1477.5386 1477.8623 1478.6554 1481.9719 1487.9565 1489.2393 1563.4165 1581.5582 2846.3457 2855.5638 2898.1604 2972.1266 2972.6088 2983.1206 2985.6502 3007.6330 3015.1720 3017.9456 3030.1505 3039.7765 3041.0437 3069.7883 3070.8447 3073.9833 3074.4389 3076.3755 3121.9796 3132.8767 3149.9358 3167.9504
redmass: 4.2248 3.8526 3.5727 2.9363 3.0714 1.6237 1.6702 3.9153 2.1666 1.9685 2.6089 1.2838 1.3764 2.6094 2.6750 2.7582 2.5455 3.0569 3.4618 3.3085 3.2573 2.8830 5.3597 5.7106 1.0961 1.1133 1.7454 1.5656 1.5954 3.5137 2.7780 1.3632 1.2192 1.5462 1.3481 2.1514 1.5253 4.6647 1.3432 2.0570 3.9443 2.3524 2.6514 2.8588 2.2613 1.9298 1.7076 2.1201 1.8595 1.5684 1.0725 2.1054 1.7105 1.7285 1.4653 1.4131 1.1646 1.3023 1.2081 1.3542 1.7842 1.6035 1.6184 1.8394 1.3075 1.3779 1.4161 1.2179 1.2205 1.9339 1.7203 1.3253 1.0671 1.0717 1.0661 1.0443 1.0640 1.0450 1.0844 1.0809 1.0823 5.7657 5.8216 1.0711 1.0708 1.0693 1.0356 1.0356 1.0622 1.0616 1.0600 1.0859 1.0872 1.0901 1.0992 1.0991 1.1013 1.1012 1.0990 1.0990 1.1031 1.0881 1.0887 1.0947 1.1015
irintensity: 1.8527 0.5568 0.4487 0.0117 0.6087 0.0655 0.0884 0.5704 0.8053 0.4958 2.7176 0.1692 0.7301 0.3954 0.7889 0.1470 1.2524 6.9698 4.2375 1.2196 3.5741 17.2897 6.8762 3.8113 7.2229 7.5486 35.0746 16.6597 12.0960 8.2105 10.8523 6.0762 2.0399 2.6556 0.4874 1.9867 1.1229 4.2725 0.3432 12.0213 1.1316 2.3774 7.5115 24.0686 77.2556 31.5735 15.3636 2.7844 7.7061 5.7624 2.4592 16.5621 9.1775 3.0291 5.8474 6.6959 0.8385 0.7484 7.1519 21.0860 2.4953 11.3930 6.0389 2.1699 21.1151 1.6348 1.5133 17.1539 14.0815 17.0215 38.0346 18.7530 0.3681 2.5470 0.7418 9.6184 2.1013 13.8369 14.1152 14.4487 8.9899 13.4874 56.0880 40.5821 139.1311 67.5853 53.8605 37.1858 24.4504 24.9374 20.1356 7.8890 23.1612 17.5830 12.2051 16.9161 76.7871 97.0092 48.0422 51.3485 33.6693 17.4434 4.7013 30.7157 24.5822
temp: 298.150 k
press: 1.00000 atm
elementType: 7 7 6 6 6 6 6 6 6 6 6 6 6 6 6 1 1 1 1 1 1 1 1 1 1 1 1 1 1 1 1 1 1 1 1 1 1
symmnumber: 1
zpe: 854386.8 jmol-1
zpe.correction: 0.325419 hartree
zpe.thermalcorrener: 0.342359 hartree
zpe.thermalcorrenthalpy: 0.343303 hartree
zpe.thermalcorrgfe: 0.278020 hartree
zpe.sumelectzpe: -616.880593 hartree
zpe.sumelectthermal: -616.863652 hartree
zpe.sumelectthermalent: -616.862708 hartree
zpe.sumelectthermalfe: -616.927991 hartree
dipole: 0.8480 1.5219 0.1233
dipole: 1.7466
quadrupole: -80.6710 -93.3786 -93.8466
quadrupole: 4.6308 1.0939 1.8301
quadrupole: 8.6277 -4.0799 -4.5479 4.6308 1.0939 1.8301
hfenergy: -617.2060118 hartree
pointgroup: C01 [X(C13H22N2)]
dipole: -0.3476112 -0.5881902 0.0733693 debye
polarizability: 198.9565052|3.924053|147.8750848|5.554705|-15.9184286|120.1701149 unknown
InChI: InChI=1S/C13H22N2/c1-3-10-15(11-4-2)12-8-13-7-5-6-9-14-13/h5-7,9H,3-4,8,10-12H2,1-2H3
charge 0 multiplicity 1
37 atoms
N  1.778159 -0.063159 -0.095459
N  -2.491604 1.121523 -0.507051
C  0.333254 -0.251433 -0.368951
C  2.265672 1.294597 -0.453052
C  2.629271 -1.158723 -0.626209
C  -0.553262 0.327192 0.770665
C  3.444518 1.766674 0.425597
C  2.60244 -2.426712 0.255351
C  -2.027767 0.236721 0.437006
C  3.95771 3.163279 0.01201
C  3.475486 -3.560754 -0.324748
C  -2.879457 -0.726825 1.037892
C  -4.240858 -0.78083 0.664706
C  -3.80774 1.056099 -0.85932
C  -4.720367 0.128955 -0.305387
H  0.020736 0.221498 -1.330325
H  0.128103 -1.334076 -0.461759
H  2.559979 1.353284 -1.532379
H  1.427603 2.006219 -0.325077
H  2.34601 -1.431331 -1.675537
H  3.672076 -0.791272 -0.672706
H  -0.287559 1.390161 0.917602
H  -0.322404 -0.211703 1.706277
H  3.110612 1.772896 1.480467
H  4.274646 1.035245 0.365119
H  2.948634 -2.150698 1.269332
H  1.55941 -2.784008 0.366832
H  4.3204 3.162783 -1.033634
H  3.155323 3.921642 0.086957
H  4.792208 3.491175 0.658176
H  3.126982 -3.858845 -1.332013
H  4.531939 -3.244119 -0.416552
H  3.448362 -4.457542 0.320578
H  -2.475247 -1.414651 1.7883
H  -4.913758 -1.514386 1.122238
H  -4.135488 1.782329 -1.613045
H  -5.767919 0.125197 -0.623003
