program: Gaussian 09
title: 000011817
version: EM64L-G09RevD.01
frameworkgroup: C1[X(C7H5N3O7)]
method: RPBEPBE
basis: SDD
operation: Freq
keyword: #pfreq=noraman
keyword: PBEPBE/SDD
title: #p freq=noraman PBEPBE/SDD
converged: YES YES NO NO
title: Mulliken charges:
elementType: O O O O O O O N N N C C C C C C C H H H H H
charge: -0.250000 -0.167802 -0.167814 -0.175856 -0.175855 -0.178273 -0.178271 0.022090 0.022085 0.019913 0.082499 0.382792 0.382782 0.480399 -0.519516 -0.519567 -0.501727 0.336022 0.336028 0.260381 0.260286 0.249403
chargesum: 0.00000
title: Mulliken charges with hydrogens summed into heavy atoms:
elementType: O O O O O O O N N N C C C C C C C
charge: -0.250000 -0.167802 -0.167814 -0.175856 -0.175855 -0.178273 -0.178271 0.022090 0.022085 0.019913 0.082499 0.382792 0.382782 0.480399 -0.183494 -0.183539 0.268344
polarizability: 1.86692398e+02 9.43373808e-04 1.59328657e+02 -7.49480409e+00 2.52033338e-03 6.06471480e+01
1716.lowfreq: -5.6263 -3.8638 -0.0007 -0.0006 -0.0006 3.3208 39.1460 48.5128 55.2527
frequency: 39.1207 48.5126 55.2523 61.2325 94.0752 108.5720 137.3951 165.6347 168.0200 201.8954 208.2547 249.5871 305.8046 318.1715 325.1080 336.8889 353.1830 447.4492 483.9329 517.7468 539.0767 604.6788 651.9739 665.6153 675.8198 711.2152 723.3732 729.8383 744.1514 803.2847 863.8065 881.4126 932.1485 956.6559 960.9329 1078.1053 1093.4204 1140.9270 1147.8062 1180.6819 1203.1064 1210.2966 1222.9301 1245.3442 1352.2208 1369.4892 1374.5273 1389.7700 1418.3313 1424.7342 1457.3347 1466.4115 1466.8973 1580.7539 1602.5541 3025.0222 3149.0858 3161.5058 3183.4305 3184.3869
redmass: 15.2408 7.2570 15.3088 8.6209 1.0821 10.1975 9.1223 14.3745 5.0003 3.5371 4.6366 9.6189 11.8889 10.4886 9.9688 10.2955 9.4332 6.2814 10.9995 8.8894 3.9599 9.4773 5.9010 12.1672 10.8305 6.1249 8.2179 7.8746 14.9609 6.1972 12.3931 11.5476 8.6979 1.4004 1.6465 1.7226 1.1970 1.6990 3.2901 1.6459 11.0363 7.9209 7.4579 5.4463 5.0636 4.1588 11.8240 14.1157 1.7983 6.7721 2.0462 1.2014 1.0586 9.8019 7.6877 1.0268 1.1075 1.1057 1.0923 1.0935
irintensity: 0.1306 1.9009 0.0846 1.4477 0.9251 8.3151 0.1001 1.5693 6.0018 9.1537 14.2442 0.6894 2.3357 3.7529 0.0092 5.5921 1.2550 0.4545 3.9731 3.0651 8.9340 14.4394 3.5536 29.3786 43.6153 14.9186 0.0192 14.5036 5.0420 20.3356 16.4836 10.5854 84.5301 2.2686 38.2660 80.1966 0.6288 18.5845 8.4336 1.9627 208.8852 316.1200 142.0857 75.6351 32.8340 117.6829 40.9163 42.5678 76.2226 14.5642 121.7439 60.0465 15.4152 31.9491 86.9265 46.2583 3.7590 8.2428 27.7456 14.6483
temp: 298.150 k
press: 1.00000 atm
elementType: 8 8 8 8 8 8 8 7 7 7 6 6 6 6 6 6 6 1 1 1 1 1
symmnumber: 1
zpe: 348106.7 jmol-1
zpe.correction: 0.132587 hartree
zpe.thermalcorrener: 0.148074 hartree
zpe.thermalcorrenthalpy: 0.149018 hartree
zpe.thermalcorrgfe: 0.088051 hartree
zpe.sumelectzpe: -959.031002 hartree
zpe.sumelectthermal: -959.015514 hartree
zpe.sumelectthermalent: -959.014570 hartree
zpe.sumelectthermalfe: -959.075537 hartree
dipole: 2.2281 -0.0008 -1.6778
dipole: 2.7891
quadrupole: -107.3698 -118.3025 -94.4911
quadrupole: -0.0043 -3.3593 0.0010
quadrupole: -0.6487 -11.5813 12.2300 -0.0043 -3.3593 0.0010
hfenergy: -959.1635886 hartree
pointgroup: C01 [X(C7H5N3O7)]
dipole: 0.8316001 0.0000811 -0.7159243 debye
dipolederiv: -1.7539586 -0.0007214 0.2498844 -0.0002189 -0.311876 0.0000054 -0.080554 -0.0000565 -0.3626017 -0.3850574 0.0062301 0.1583664 0.0563756 -0.7183545 -0.2031528 0.157 -0.1359955 -0.3508517 -0.3852778 -0.0060426 0.1580421 -0.0562077 -0.7186083 0.2031008 0.1568197 0.1362114 -0.3505354 -0.5959285 -0.1036134 0.2587565 -0.1717512 -0.4747061 -0.0112341 0.2073312 -0.1053348 -0.3588246 -0.5965441 0.103474 0.2586255 0.1715067 -0.4742861 0.0115553 0.2072054 0.1056614 -0.3584617 -0.7078433 0.1823738 -0.001042 0.1645525 -0.6039534 0.0019687 -0.0054748 0.0061315 -0.2042856 -0.7074878 -0.1824523 -0.0010978 -0.164662 -0.6042836 -0.0021075 -0.005538 -0.0062672 -0.2042864 0.8106466 0.3452076 -0.466332 0.2881462 1.3530159 0.2615231 -0.3668894 0.2545656 0.5355788 0.812004 -0.3457635 -0.4657967 -0.2885493 1.3526793 -0.2618394 -0.3665043 -0.2549036 0.5347719 1.8325953 0.0003791 0.0106169 0.0004343 0.9882053 0.0001566 0.0011683 0.0001308 0.1803152 1.3465104 0.0005796 0.0053207 0.0003769 0.4259443 0.0000238 0.3848468 0.0002012 0.036864 -0.4286877 -0.1469882 0.0677571 0.1633483 -0.3208269 -0.0285738 0.0445724 -0.0216423 0.0278177 -0.4286346 0.1471418 0.0677413 -0.1632594 -0.3214083 0.0286295 0.0439826 0.0216753 0.0278995 -0.6000018 -0.0001058 -0.0090212 -0.0001292 -0.271887 -0.0000311 -0.02653 -0.0000171 0.0729508 0.2457962 0.2057674 0.0139304 0.196512 0.0263982 0.0047781 -0.0290044 -0.0620391 -0.04495 0.2461563 -0.2057179 0.0139145 -0.1963013 0.0260429 -0.0047266 -0.0290857 0.0619768 -0.0449628 0.8912968 0.0003744 -0.2389444 -0.0002829 0.2143915 -0.0000247 -0.420462 -0.0003691 0.4009367 0.171905 0.0115463 -0.0082571 -0.0023876 0.1450929 0.0005188 0.0257866 0.0099277 0.1749875 0.1719311 -0.0114992 -0.0082505 0.0023915 0.1450992 -0.0005398 0.0258721 -0.0099673 0.174998 0.0635044 0.0275337 -0.0142398 -0.0466809 0.0093633 0.1187193 0.077241 0.0646264 0.0343505 0.0633069 -0.027879 -0.0145662 0.0463135 0.0099562 -0.1188947 0.0769347 -0.0647402 0.033968 -0.0662313 0.0001753 -0.0354083 0.0004731 0.1240012 0.0001449 -0.0787183 0.0002244 0.0443215 unknown
polarizability: 185.1777827|0.0124789|159.3286623|-15.6456842|0.0013477|62.161758 unknown
InChI: InChI=1S/C7H5N3O7/c1-17-7-5(9(13)14)2-4(8(11)12)3-6(7)10(15)16/h2-3H,1H3
charge 0 multiplicity 1
22 atoms
O  2.404093 0.001335 0.20837
O  0.364188 3.475788 0.677557
O  0.367404 -3.475726 0.676696
O  2.06331 2.678444 -0.62011
O  2.0666 -2.676234 -0.619529
O  -3.881686 1.140623 -0.046416
O  -3.880499 -1.144752 -0.0468
N  0.957735 2.538374 0.023618
N  0.960351 -2.537518 0.023341
N  -3.286405 -0.001757 -0.040333
C  1.053012 0.000511 -0.016842
C  0.286891 1.211978 -0.013082
C  0.288192 -1.21179 -0.013364
C  -1.799347 -0.000979 -0.025869
C  -1.116996 1.22687 -0.007644
C  -1.115696 -1.228103 -0.007985
C  3.406799 0.001217 -0.904078
H  -1.667365 2.171491 0.020551
H  -1.665076 -2.173306 0.019983
H  3.283992 0.919741 -1.496656
H  3.281828 -0.915628 -1.498805
H  4.373875 -0.000681 -0.383202
