program: Gaussian 09
title: 000135110
version: EM64L-G09RevD.01
frameworkgroup: C1[X(C11H16N2O)]
method: RPBEPBE
basis: SDD
operation: Freq
keyword: #p
keyword: freq=noraman
keyword: PBEPBE/SDD
title: #p freq=noraman PBEPBE/SDD
converged: YES YES NO NO
title: Mulliken charges:
elementType: O N N C C C C C C C C C C C H H H H H H H H H H H H H H H H
charge: -0.313400 -0.089440 -0.675000 -0.364003 -0.504882 0.216229 0.156554 -0.621157 -0.617548 0.315415 -0.315370 -0.406323 -0.301284 -0.196310 0.186166 0.237890 0.225070 0.220638 0.243896 0.183287 0.215725 0.224959 0.184829 0.216238 0.230020 0.218530 0.227421 0.225233 0.297356 0.379261
chargesum: 0.00000
title: Mulliken charges with hydrogens summed into heavy atoms:
elementType: O N N C C C C C C C C C C C
charge: -0.313400 -0.089440 0.001617 0.060053 -0.059175 0.216229 0.156554 0.021751 0.008477 0.315415 -0.085350 -0.187792 -0.073863 0.028923
polarizability: 1.82550331e+02 -7.88492806e+00 1.49562703e+02 -1.71446637e+01 -5.46809375e+00 8.86175414e+01
1716.lowfreq: -7.5269 -0.0005 -0.0005 0.0006 3.7162 5.6569 23.9478 38.3291 45.4115
frequency: 23.8714 38.2768 45.4043 90.1060 140.4908 172.2529 215.5011 227.6380 235.1452 244.0256 278.0059 349.5573 384.4914 405.1920 414.3453 416.3995 438.7855 480.2246 508.3251 514.0887 552.6221 584.1751 644.4607 719.6576 730.7208 753.6646 760.7568 821.4944 825.1293 848.5859 925.6793 937.8598 949.9299 976.7411 982.7776 1024.0340 1028.6578 1036.8772 1060.9532 1078.0706 1089.7589 1130.2569 1155.0684 1161.7086 1177.3839 1215.1698 1249.6026 1270.6854 1285.2465 1298.1239 1334.4697 1349.3655 1370.6532 1406.2065 1416.0859 1428.7310 1433.9022 1443.8030 1460.6848 1463.9238 1474.1092 1475.3554 1476.0642 1485.8201 1524.8352 1572.7671 1592.4169 1630.5141 2834.1248 2846.4642 2869.6498 2970.7335 3015.0314 3017.3071 3048.8094 3064.1866 3072.2837 3082.0316 3117.8076 3138.3368 3149.6672 3170.4457 3320.7222 3630.4468
redmass: 4.0994 3.6204 2.7047 4.2399 5.6967 3.6858 1.2202 2.9647 1.4459 1.9808 1.9219 4.8045 2.1997 2.1975 3.1153 3.6970 2.9791 1.2084 3.2523 2.8426 6.5314 3.0160 4.9450 3.8448 2.3711 1.6191 2.5499 1.2187 4.9805 1.5212 2.2794 2.3370 1.7499 1.3322 2.3264 2.2989 2.1282 1.4923 1.7529 2.0816 1.3496 1.3950 1.3758 1.3801 1.0729 1.5671 2.7260 2.5469 1.8178 1.6432 1.9536 1.7312 1.3428 5.5921 1.1583 1.4949 1.3520 1.3834 1.0603 1.0948 1.1085 1.0742 1.9501 1.0628 4.0085 6.2201 1.5160 6.4836 1.0580 1.0603 1.0688 1.0666 1.0708 1.0719 1.0897 1.0908 1.0997 1.1000 1.0866 1.0894 1.0925 1.0995 1.0599 1.0913
irintensity: 0.6563 0.6543 0.4836 1.7479 0.1203 1.4116 0.0966 1.4661 3.5237 1.8675 6.2625 3.8229 11.5680 0.7657 8.7089 5.6744 0.7623 130.2900 44.6997 2.6635 0.6912 3.6006 6.6098 5.1013 39.9481 60.3012 57.5047 89.2941 4.4207 1.4770 18.2063 21.3075 0.7189 0.5343 24.7594 11.6430 24.4836 12.0526 6.3127 22.0856 7.8919 8.2732 13.7879 7.6929 21.3326 2.8130 166.0919 19.8419 52.8016 31.9787 3.3346 38.6852 6.0778 12.8591 1.1455 21.3899 22.6942 7.9021 10.2662 14.8280 13.1738 17.5088 59.4760 9.4209 193.7177 43.5581 180.8878 170.2564 87.7125 141.4615 240.0490 27.5614 30.3072 51.3629 3.9330 14.4603 38.2197 41.2258 9.0146 10.9233 28.5737 20.5839 121.8735 49.9884
temp: 298.150 k
press: 1.00000 atm
elementType: 8 7 7 6 6 6 6 6 6 6 6 6 6 6 1 1 1 1 1 1 1 1 1 1 1 1 1 1 1 1
symmnumber: 1
zpe: 661449.6 jmol-1
zpe.correction: 0.251933 hartree
zpe.thermalcorrener: 0.266158 hartree
zpe.thermalcorrenthalpy: 0.267102 hartree
zpe.thermalcorrgfe: 0.209759 hartree
zpe.sumelectzpe: -612.427437 hartree
zpe.sumelectthermal: -612.413212 hartree
zpe.sumelectthermalent: -612.412268 hartree
zpe.sumelectthermalfe: -612.469611 hartree
dipole: 0.8891 -0.7705 -0.1006
dipole: 1.1808
quadrupole: -72.3617 -76.3052 -87.0788
quadrupole: 5.6941 -3.1707 -3.4214
quadrupole: 6.2202 2.2767 -8.4969 5.6941 -3.1707 -3.4214
hfenergy: -612.67937 hartree
pointgroup: C01 [X(C11H16N2O1)]
dipole: -0.3903404 0.2203675 -0.1220873 debye
polarizability: 184.5688983|2.7999065|145.4818245|14.7552515|-14.3897258|90.6798526 unknown
InChI: InChI=1S/C11H16N2O/c1-13(2)8-7-11(14)9-5-3-4-6-10(9)12/h3-6H,7-8,12H2,1-2H3
charge 0 multiplicity 1
30 atoms
O  0.819242 -1.217204 1.040637
N  3.16696 0.309407 -0.745863
N  -1.457198 -2.447829 0.645261
C  2.689989 0.796258 0.570893
C  1.186869 1.133898 0.542468
C  0.305548 -0.125249 0.598101
C  -1.113759 -0.051852 0.193632
C  4.258993 -0.676301 -0.645472
C  3.467877 1.394114 -1.695927
C  -1.956431 -1.233892 0.229774
C  -1.700519 1.179935 -0.230712
C  -3.32604 -1.120561 -0.175301
C  -3.044894 1.275938 -0.61535
C  -3.856602 0.107101 -0.588371
H  3.266769 1.691214 0.915361
H  2.844543 -0.007815 1.310904
H  0.925108 1.768735 1.41621
H  0.953419 1.729574 -0.357445
H  3.933858 -1.515604 -0.006817
H  5.208658 -0.258006 -0.222209
H  4.488124 -1.078176 -1.649701
H  3.700179 0.967561 -2.688485
H  4.335356 2.032037 -1.381574
H  2.591187 2.056086 -1.815279
H  -1.082609 2.082858 -0.250939
H  -3.958429 -2.016703 -0.153094
H  -3.465484 2.234635 -0.933888
H  -4.908378 0.165506 -0.89176
H  -2.051265 -3.27356 0.656173
H  -0.467471 -2.466205 0.937274
