program: Gaussian 09
title: 000137009
version: EM64L-G09RevD.01
frameworkgroup: C1[X(C4H6)]
method: RPBEPBE
basis: SDD
operation: Freq
keyword: #p
keyword: freq=noraman
keyword: PBEPBE/SDD
title: #p freq=noraman PBEPBE/SDD
converged: NO YES NO NO
title: Mulliken charges:
elementType: C C C C H H H H H H
charge: -0.078556 -0.078590 -0.568750 -0.568735 0.216782 0.216798 0.215599 0.214929 0.215600 0.214924
chargesum: 0.00000
title: Mulliken charges with hydrogens summed into heavy atoms:
elementType: C C C C
charge: 0.138226 0.138208 -0.138223 -0.138211
polarizability: 8.18505493e+01 6.39253968e+00 3.69833275e+01 -1.37891070e-08 4.69457736e-09 1.81314069e+01
1716.lowfreq: 0.0002 0.0004 0.0008 10.8949 15.6420 26.8410 181.5429 290.7197 506.4537
frequency: 181.5429 290.7197 506.4521 527.5181 763.7544 890.2885 936.8613 944.7037 980.5453 985.5864 1029.2053 1216.5893 1277.8495 1286.5815 1392.8568 1450.4551 1600.4264 1656.7589 3084.8330 3092.6417 3099.5982 3103.6615 3204.7238 3205.4752
redmass: 2.6047 2.1779 2.6930 1.0741 1.6074 1.7796 1.2094 1.3639 1.3404 1.1990 1.0986 2.0237 1.3182 1.2724 1.2769 1.2104 3.3402 4.7749 1.0766 1.0618 1.0753 1.0919 1.1147 1.1142
irintensity: 0.7913 2.0275 0.0000 15.0774 0.0000 0.0000 0.0000 169.4964 0.0000 9.4579 51.4926 0.0000 0.0000 1.8044 8.8351 0.0000 26.7778 0.0000 0.0002 28.0556 0.0001 15.4720 0.0005 49.8918
temp: 298.150 k
press: 1.00000 atm
elementType: 6 6 6 6 1 1 1 1 1 1
symmnumber: 1
zpe: 219572.3 jmol-1
zpe.correction: 0.083631 hartree
zpe.thermalcorrener: 0.088318 hartree
zpe.thermalcorrenthalpy: 0.089262 hartree
zpe.thermalcorrgfe: 0.057142 hartree
zpe.sumelectzpe: -155.668449 hartree
zpe.sumelectthermal: -155.663761 hartree
zpe.sumelectthermalent: -155.662817 hartree
zpe.sumelectthermalfe: -155.694938 hartree
dipole: 0.0000 0.0000 0.0000
dipole: 0.0000
quadrupole: -22.5493 -21.9406 -29.1443
quadrupole: 0.0230 0.0000 0.0000
quadrupole: 1.9954 2.6041 -4.5995 0.0230 0.0000 0.0000
hfenergy: -155.7520793 hartree
pointgroup: C01 [X(C4H6)]
dipole: 0.0000169 -0.0000003 0.0000062 debye
dipolederiv: 0.1464072 0.0209911 0.0000025 -0.0824993 0.1334528 0.0000102 -0.000006 0.0000071 -0.1205251 0.1463776 0.0209821 -0.0000025 -0.0825014 0.1334498 -0.0000102 0.000006 -0.0000071 -0.1205296 -0.212466 -0.0582365 0.0000039 -0.0141668 0.1102999 0.0000047 0.0000012 0.0000049 -0.4385169 -0.2124484 -0.0582472 -0.0000039 -0.0141897 0.1102858 -0.0000047 -0.0000012 -0.0000049 -0.4385101 0.0417457 -0.0530533 -0.0000015 0.0282602 -0.1333882 -0.0000063 -0.0000004 -0.0000058 0.1627122 0.0417543 -0.0530366 0.0000015 0.0282687 -0.1333775 0.0000063 0.0000004 0.0000058 0.1627208 -0.0543459 0.0837232 -0.0000014 0.0945645 0.0136944 -0.0000011 0.0000013 -0.0000009 0.1932709 0.0786662 0.0065658 -0.0000015 -0.0261572 -0.1240625 -0.000004 -0.0000019 -0.000003 0.2030549 -0.0543591 0.0837225 0.0000014 0.0945604 0.0137116 0.0000011 -0.0000013 0.0000009 0.1932711 0.0786684 0.006589 0.0000015 -0.0261394 -0.124066 0.000004 0.0000019 0.000003 0.2030518 unknown
polarizability: 81.7087811|6.8706048|37.1250957|0.|0.|18.1314069 unknown
InChI: InChI=1S/C4H6/c1-3-4-2/h3-4H,1-2H2
charge 0 multiplicity 1
10 atoms
C  -0.614786 0.399025 0.000029
C  0.614803 -0.398933 0.000029
C  -1.87328 -0.12934 0.000011
C  1.873266 0.129516 0.000011
H  -0.490437 1.492415 0.000053
H  0.490498 -1.492322 0.000053
H  -2.764091 0.507657 0.000009
H  -2.040112 -1.213748 -0.000002
H  2.764131 -0.507406 0.000009
H  2.040007 1.213937 -0.000002
