program: Gaussian 09
title: 000137000
version: EM64L-G09RevD.01
frameworkgroup: C1[X(C6H3ClF2)]
method: RPBEPBE
basis: SDD
operation: Freq
keyword: #p
keyword: freq=noraman
keyword: PBEPBE/SDD
title: #p freq=noraman PBEPBE/SDD
converged: NO NO NO NO
title: Mulliken charges:
elementType: Cl F F C C C C C C H H H
charge: -0.029428 -0.193056 -0.193054 0.002635 -0.377554 -0.377539 0.414412 0.414398 -0.526408 0.288001 0.287994 0.289599
chargesum: 0.00000
title: Mulliken charges with hydrogens summed into heavy atoms:
elementType: Cl F F C C C C C C
charge: -0.029428 -0.193056 -0.193054 0.002635 -0.089553 -0.089545 0.414412 0.414398 -0.236809
polarizability: 1.00482272e+02 -7.80382943e-05 7.91527194e+01 8.84042325e-04 2.19316661e-05 2.85481854e+01
1716.lowfreq: -0.0022 -0.0020 0.0007 8.1647 9.7141 10.6324 160.8680 212.9795 224.4480
frequency: 160.8679 212.9788 224.4394 238.1574 288.6462 393.8021 488.7865 492.1845 513.5510 538.1150 575.0030 663.9928 828.2524 842.5716 856.2508 863.2125 954.6477 984.9359 1082.9242 1104.7057 1232.8254 1259.0302 1380.3623 1435.6155 1439.5412 1598.4695 1600.6522 3181.7226 3183.4456 3186.8978
redmass: 10.5065 15.0262 5.6674 4.9189 18.3920 11.7744 4.8295 8.2420 11.8881 5.0495 4.7128 2.2514 11.4790 1.3537 1.4166 1.6620 5.1578 6.2278 1.4578 1.5603 1.2223 7.9400 10.1718 3.8416 3.3480 8.3099 7.4224 1.0935 1.0942 1.0946
irintensity: 0.3724 0.8877 0.4960 0.0000 1.2767 7.8895 0.6892 8.3086 1.9461 0.4844 0.0000 24.7616 94.7775 1.4140 0.0012 105.7274 72.4947 0.4059 7.6012 45.1393 0.0163 4.9723 0.8848 61.3397 49.7702 183.8220 164.8652 1.8516 3.4304 1.6753
temp: 298.150 k
press: 1.00000 atm
elementType: 17 9 9 6 6 6 6 6 6 1 1 1
symmnumber: 1
zpe: 190245.6 jmol-1
zpe.correction: 0.072461 hartree
zpe.thermalcorrener: 0.079864 hartree
zpe.thermalcorrenthalpy: 0.080808 hartree
zpe.thermalcorrgfe: 0.039818 hartree
zpe.sumelectzpe: -889.535841 hartree
zpe.sumelectthermal: -889.528437 hartree
zpe.sumelectthermalent: -889.527493 hartree
zpe.sumelectthermalfe: -889.568484 hartree
dipole: -0.1665 0.0000 0.0000
dipole: 0.1665
quadrupole: -58.2064 -59.9619 -58.4725
quadrupole: 0.0001 -0.0001 0.0000
quadrupole: 0.6739 -1.0817 0.4078 0.0001 -0.0001 0.0000
hfenergy: -889.6083015 hartree
pointgroup: C01 [X(C6H3Cl1F2)]
dipole: 0.0654912 0.0000178 -0.0000192 debye
dipolederiv: -0.750873 -0.0000756 0.0000136 -0.0000676 -0.117363 -0.0000007 0.0000033 -0.0000014 -0.0508897 -0.4729967 -0.3690124 0.000006 -0.4031004 -0.8456285 0.0000094 0.0000077 0.0000101 -0.1483186 -0.4731917 0.3691094 -0.0000057 0.4032017 -0.8454487 0.0000119 0.0000015 -0.000007 -0.1483167 1.230026 0.0000977 -0.0000218 0.0001013 0.392242 0.0000046 -0.0000138 0.000003 -0.0351132 -0.5436272 0.2146609 -0.0000022 0.0835757 -0.2161301 -0.0000137 -0.0000092 -0.0000253 -0.150319 -0.5435582 -0.2147427 0.0000038 -0.0836796 -0.2162045 0.0000076 0.0000098 0.0000057 -0.1503152 0.7577066 0.3780241 -0.0000143 0.3088939 1.0512032 -0.0000171 -0.0000143 -0.0000159 0.1320394 0.7578721 -0.3781097 0.0000042 -0.3089674 1.0510415 -0.0000139 -0.0000017 0.0000078 0.1320413 -0.1809409 0.0000421 0.000012 0.0000442 -0.4707151 0.0000039 0.0000117 0.0000045 -0.1937153 0.0897353 -0.0379203 0.0000039 -0.0281876 0.0517799 0.0000065 0.0000085 0.0000158 0.1991913 0.089714 0.0379353 0.0000028 0.0281999 0.0517903 -0.0000003 0.0000023 0.000001 0.1991871 0.0401336 -0.0000086 -0.0000022 -0.0000139 0.1134332 0.000002 -0.0000057 0.0000016 0.2145285 unknown
polarizability: 100.4822718|0.0024428|79.1527197|-0.000884|-0.000022|28.5481854 unknown
InChI: InChI=1S/C6H3ClF2/c7-4-1-5(8)3-6(9)2-4/h1-3H
charge 0 multiplicity 1
12 atoms
Cl 3.160259 0.000362 -0.000057
F  -1.434289 -2.407935 0.000043
F  -1.434887 2.40755 -0.000008
C  1.347952 0.000166 -0.000024
C  0.669374 1.236478 0.000028
C  0.669683 -1.236316 -0.000002
C  -0.737382 -1.193658 0.000022
C  -0.737691 1.193443 -0.000004
C  -1.481789 -0.000208 0.00002
H  1.20021 2.192448 -0.000013
H  1.200783 -2.192161 -0.00001
H  -2.575323 -0.000371 0.000006
