program: Gaussian 09
title: 000136944
version: EM64L-G09RevD.01
frameworkgroup: C1[X(C10H8O4)]
method: RPBEPBE
basis: SDD
operation: Freq
keyword: #pfreq=noraman
keyword: PBEPBE/SDD
title: #p freq=noraman PBEPBE/SDD
converged: YES YES NO NO
title: Mulliken charges:
elementType: O O O O C C C C C C C C C C H H H H H H H H
charge: -0.243477 -0.245479 -0.200183 -0.179983 -0.039448 0.314498 0.428313 -0.441205 0.353831 0.087957 -0.468961 -0.770575 0.126433 -0.755015 0.281909 0.258543 0.257313 0.257280 0.222626 0.239397 0.258113 0.258113
chargesum: 0.00000
title: Mulliken charges with hydrogens summed into heavy atoms:
elementType: O O O O C C C C C C C C C C
charge: -0.243477 -0.245479 -0.200183 -0.179983 -0.039448 0.314498 0.428313 -0.159296 0.353831 0.087957 -0.210418 -0.033356 0.126433 0.000609
polarizability: 1.88390514e+02 5.81668330e+00 1.45231191e+02 1.64036220e-02 1.06310758e-02 5.72105364e+01
1716.lowfreq: -8.8118 -4.0659 -2.9721 -0.0010 -0.0008 -0.0002 57.6914 83.6735 124.2972
frequency: 57.6889 83.6706 124.2930 150.1603 162.6692 195.4245 213.0074 229.9123 276.6407 299.3573 314.7496 360.5068 407.1640 476.2284 503.1739 526.6324 548.4881 579.8659 585.7492 647.3085 656.5325 668.6997 695.1369 740.9122 757.7482 827.8187 841.5651 861.1605 944.2035 992.8342 1012.9993 1043.9456 1048.0242 1048.5384 1115.8591 1161.7840 1175.0271 1240.3632 1298.8324 1372.4694 1399.0232 1403.6620 1413.2136 1448.0144 1448.5751 1450.6751 1462.9325 1515.9010 1586.2933 1622.6021 1689.5316 1720.3302 2995.5864 2997.0848 3077.2817 3078.0389 3107.7778 3120.0599 3176.6607 3206.0103
redmass: 5.1557 4.4048 1.1397 4.9126 1.5514 1.8673 3.9977 5.4442 5.3965 4.3802 3.8227 8.3903 7.1024 6.0429 7.9783 3.9657 6.8795 5.3023 4.2191 5.4672 8.7981 4.7977 6.8086 6.3950 5.9239 7.6589 1.3846 1.3824 6.0559 1.9310 1.5317 1.5894 4.4085 1.5435 2.9844 2.7235 7.3042 1.4700 2.7740 3.8531 1.3464 1.2720 3.0955 1.0447 1.0435 1.1289 1.1138 8.9995 6.5403 6.6398 11.8025 11.3736 1.0373 1.0368 1.0972 1.0953 1.1018 1.0998 1.0915 1.0942
irintensity: 9.2024 0.1470 0.3400 2.3393 0.0009 1.3454 3.9258 1.5113 0.0071 2.8245 0.4608 0.4056 9.6149 2.2609 1.4151 5.8566 2.3670 15.1762 2.6855 4.8425 8.0018 0.0187 29.5913 55.2776 6.3744 80.5678 32.0574 29.0418 56.2822 11.5868 2.4977 12.8279 35.9935 11.2063 24.2302 2.6066 20.1119 4.8945 36.5534 3.0777 67.0624 38.8788 23.7673 14.9496 17.7195 40.4484 29.5931 288.8254 40.8573 247.5130 618.4464 502.4376 6.0277 6.0049 5.2036 5.0377 23.4368 10.1684 0.6679 2.4041
temp: 298.150 k
press: 1.00000 atm
elementType: 8 8 8 8 6 6 6 6 6 6 6 6 6 6 1 1 1 1 1 1 1 1
symmnumber: 1
zpe: 413706.9 jmol-1
zpe.correction: 0.157573 hartree
zpe.thermalcorrener: 0.169957 hartree
zpe.thermalcorrenthalpy: 0.170901 hartree
zpe.thermalcorrgfe: 0.119059 hartree
zpe.sumelectzpe: -685.769160 hartree
zpe.sumelectthermal: -685.756776 hartree
zpe.sumelectthermalent: -685.755832 hartree
zpe.sumelectthermalfe: -685.807674 hartree
dipole: 2.8940 -0.1116 -0.0004
dipole: 2.8961
quadrupole: -79.7006 -89.4033 -79.7269
quadrupole: -24.8365 0.0013 0.0001
quadrupole: 3.2430 -6.4597 3.2167 -24.8365 0.0013 0.0001
hfenergy: -685.9267329 hartree
pointgroup: C01 [X(C10H8O4)]
dipole: 1.1334436 -0.1165075 -0.000142 debye
dipolederiv: -1.4203709 -0.2958818 -0.0000032 0.0362757 -0.3746173 -0.0000904 -0.0005467 -0.0000972 -0.2034036 -0.5760465 0.523984 -0.0000255 -0.0613836 -0.9825909 -0.0000512 0.0000573 -0.0001609 -0.1997058 -0.4840844 -0.2053159 -0.000063 -0.2442797 -1.3609649 -0.0002799 0.0000085 0.0000958 -0.3004216 -1.1920348 -0.4721134 -0.0005213 -0.7230116 -0.8128196 -0.0004583 0.0007535 0.0004822 -0.3217567 -0.7382673 -0.3398928 -0.0001614 0.4377552 -0.8336175 0.0000135 0.0000654 -0.0001114 -0.1080911 1.1020714 0.0304602 0.0000298 -0.2897687 0.8240268 0.000002 -0.0000884 0.0001377 0.2352167 0.9613346 0.1933196 0.0003285 -0.1380187 0.624588 0.0001523 0.0000168 0.0000329 0.0647488 -1.1614578 0.2435957 -0.0000715 -0.0069823 -0.1321888 -0.0000087 -0.0001249 -0.0000379 -0.2340371 1.1043953 -0.1795462 0.0000737 0.4028389 0.6039507 0.0000427 0.0001662 -0.000026 0.1025771 0.9181035 0.0703536 0.000137 0.2466666 1.9235239 0.0003621 0.0000563 0.000176 0.265383 -0.4873989 -0.2435791 -0.00022 -0.6608119 -0.690987 -0.0001964 -0.0003002 -0.0002271 -0.2083948 0.0702059 -0.1160403 0.0000164 -0.0102695 -0.3173322 -0.0000637 -0.0000794 0.0000526 0.0037041 1.963336 0.5092768 0.0005425 0.8588453 1.1921471 0.0006029 0.0001199 -0.0001477 0.2837471 -0.3584644 0.1604534 -0.0000232 -0.0014346 0.0039349 -0.0000037 -0.0000938 0.0000524 0.0235349 0.0958075 0.0072468 -0.0000116 0.0360021 0.0154281 -0.0000016 -0.0000222 0.0000009 0.1850083 0.001729 0.049315 -0.0000126 0.0563262 0.0391943 -0.0000489 0.0000236 -0.0001159 0.1715285 0.0957526 -0.0105192 0.0839222 -0.0083559 0.0747522 0.0275288 0.060356 0.0387977 0.0016807 0.0957575 -0.0104884 -0.0839192 -0.0083493 0.0747567 -0.027492 -0.0603457 -0.0388686 0.0015155 -0.1381726 0.1336853 -0.0000134 0.0012822 0.0689996 -0.0000152 -0.0000333 -0.0000244 0.1105092 0.0727609 -0.0537592 -0.0000061 0.0356592 -0.1029295 -0.0000088 -0.0000046 -0.000015 0.1247916 0.0375212 0.002738 -0.0591682 0.020526 0.081373 -0.0686229 -0.100735 -0.0404724 0.0009162 0.0375223 0.0027079 0.0591699 0.0204883 0.0813725 0.0686372 0.1007505 0.0404761 0.000949 unknown
polarizability: 188.9557508|3.0197807|144.6659539|0.0170488|0.0095623|57.2105364 unknown
InChI: InChI=1S/C10H8O4/c1-5-3-8(11)14-7-4-6(2)13-10(12)9(5)7/h3-4H,1-2H3
charge 0 multiplicity 1
22 atoms
O  -1.167184 -1.627624 -0.000094
O  2.426726 0.453996 0.000485
O  1.398118 2.515211 0.000588
O  -3.482924 -1.788185 -0.000051
C  -0.057555 0.546339 0.00024
C  -0.022221 -0.868739 0.000175
C  -1.352185 1.218507 0.000161
C  1.200266 -1.613415 0.000344
C  2.398761 -0.931415 0.000445
C  1.201415 1.287348 0.000679
C  -2.507741 0.446531 -0.000252
C  -1.462847 2.725032 0.000623
C  -2.526664 -0.999553 -0.001048
C  3.76976 -1.536412 0.000515
H  1.167141 -2.7030 0.000319
H  -3.491125 0.923731 -0.000069
H  -0.954911 3.162832 -0.876782
H  -0.955226 3.16224 0.878498
H  -2.520086 3.036084 0.00053
H  3.71448 -2.635947 0.000452
H  4.336839 -1.204228 0.888828
H  4.336961 -1.204135 -0.887686
