program: Gaussian 09
title: 000136937
version: EM64L-G09RevD.01
frameworkgroup: C1[X(C9H8N2O)]
method: RPBEPBE
basis: SDD
operation: Freq
keyword: #pfreq=noraman
keyword: PBEPBE/SDD
title: #p freq=noraman PBEPBE/SDD
converged: NO YES NO YES
title: Mulliken charges:
elementType: O N N C C C C C C C C C H H H H H H H H
charge: -0.227588 -0.145149 -0.034265 0.285208 0.127243 -0.334693 -0.365309 0.108568 -0.222388 -0.219348 -0.226004 -0.746782 0.266305 0.272605 0.234957 0.235224 0.235186 0.249713 0.249707 0.256811
chargesum: 0.00000
title: Mulliken charges with hydrogens summed into heavy atoms:
elementType: O N N C C C C C C C C C
charge: -0.227588 -0.145149 -0.034265 0.285208 0.127243 -0.068388 -0.092704 0.108568 0.012570 0.015876 0.009182 0.009448
polarizability: 1.89620825e+02 -7.03561384e-01 1.08197778e+02 2.57892673e-03 4.23489212e-03 4.98455265e+01
1716.lowfreq: -121.2016 -10.7432 -0.0010 0.0005 0.0008 6.0257 6.4480 56.0590 89.6292
frequency: -121.1996 55.9688 89.6259 116.7584 218.3534 298.9106 316.5358 332.1668 400.6127 465.1411 481.4948 613.0432 625.6450 645.4765 697.3347 704.0571 707.8424 784.9272 809.3878 860.5786 901.7607 946.4427 952.9345 989.3174 991.7691 1000.2123 1007.1060 1009.1428 1036.3940 1053.3118 1088.0057 1175.9505 1188.9836 1230.3309 1298.1542 1322.4301 1387.9663 1399.7739 1437.2469 1442.2954 1459.6739 1463.6655 1473.2920 1544.2779 1588.3327 1619.4018 3009.1577 3093.9410 3130.7346 3134.1016 3145.1162 3157.4103 3167.2015 3175.6181
redmass: 1.0382 4.5609 5.3199 4.3183 4.3222 3.9194 5.2458 5.4477 2.8204 5.6254 3.8029 6.4547 5.5909 5.5931 1.8672 6.3414 4.5052 1.9971 12.0258 1.2469 12.0702 1.4146 4.3665 6.2527 1.3866 1.9994 1.3316 6.0367 2.1694 1.5028 1.6229 1.0573 1.1145 4.9669 4.7212 1.3464 8.4840 1.2189 3.0187 4.0516 2.0795 1.0436 1.2329 6.8998 6.2902 6.1223 1.0372 1.0982 1.0996 1.0855 1.0888 1.0933 1.0965 1.1012
irintensity: 0.3394 1.1138 0.7920 1.0591 1.6200 1.7450 0.9403 2.5641 0.0039 0.0835 4.8647 0.1340 1.6066 3.0191 49.7050 21.4035 32.7328 39.9848 0.8359 0.0005 6.3161 5.2576 0.5794 0.1119 0.0255 0.6276 0.3565 25.4074 6.4522 5.7611 6.3620 0.1029 7.1849 8.3860 80.9196 7.3379 2.7614 24.7481 60.3935 41.2827 62.1141 18.0869 22.1945 53.1467 1.0079 14.1126 10.5483 9.5339 5.0659 0.0366 9.7218 14.9406 11.0270 15.9990
temp: 298.150 k
press: 1.00000 atm
elementType: 8 7 7 6 6 6 6 6 6 6 6 6 1 1 1 1 1 1 1 1
symmnumber: 1
zpe: 396235.0 jmol-1
zpe.correction: 0.150918 hartree
zpe.thermalcorrener: 0.160099 hartree
zpe.thermalcorrenthalpy: 0.161043 hartree
zpe.thermalcorrgfe: 0.115633 hartree
zpe.sumelectzpe: -531.605453 hartree
zpe.sumelectthermal: -531.596272 hartree
zpe.sumelectthermalent: -531.595328 hartree
zpe.sumelectthermalfe: -531.640738 hartree
dipole: -1.7481 1.5519 0.0003
dipole: 2.3376
quadrupole: -54.0094 -69.5395 -72.2287
quadrupole: 6.2199 0.0014 0.0004
quadrupole: 11.2498 -4.2803 -6.9695 6.2199 0.0014 0.0004
hfenergy: -531.7563712 hartree
pointgroup: C01 [X(C9H8N2O1)]
dipole: -0.6982754 -0.5985131 -0.0001216 debye
dipolederiv: -0.5064495 0.1831648 0.0000341 -0.1108207 -0.5082444 -0.0000296 0.0000576 0.000057 -0.0925681 -1.0624878 0.1162024 0.0000163 0.3008415 -0.3698519 0.0000029 0.0000592 -0.0000164 -0.216087 -0.2785129 -0.1397765 0.0000361 0.0438229 -0.1211673 0.0000179 -0.0000177 -0.0000651 -0.1677645 -0.2536269 -0.0211927 0.0000025 -0.0483648 -0.0157523 0.000008 -0.0000419 0.0000017 0.0189983 1.136193 -0.0334557 -0.0000385 -0.0077336 0.4814678 -0.0000315 0.0000035 -0.0000135 0.1350869 0.0612182 0.1100608 0.0000042 -0.0793585 0.0080473 0.0000062 -0.0000154 0.0000002 -0.1240173 0.0141991 -0.1053078 -0.0000069 0.0938952 -0.0016081 0.0000082 0.0000147 0.0000029 -0.1211474 0.9655439 -0.1591315 -0.0001154 -0.2289741 0.2472981 0.0000432 -0.0002105 0.0000986 0.0578491 -0.0946403 -0.1642911 -0.0000085 -0.2299422 0.041509 0.0000112 -0.0000104 0.0000105 -0.1485481 -0.114147 0.1498799 0.0000085 0.1793925 0.0912535 0.0000133 0.0000161 0.0000144 -0.1507598 0.0854491 0.0062702 -0.0000015 0.0270397 0.0148702 0.0000071 -0.0000041 0.0000082 -0.1413139 -0.1834351 0.0969264 0.0000419 0.0573213 0.0162351 0.0000154 0.0002317 -0.0001041 0.0532343 0.0911152 -0.0689678 -0.0000028 -0.0576302 0.0038539 -0.0000079 -0.000006 -0.000006 0.1597127 0.079514 0.0749437 0.0000046 0.0614424 0.0241591 -0.0000089 0.0000029 -0.0000075 0.1583678 0.0055449 0.0856731 0.0000058 0.1084805 -0.0453449 -0.0000112 0.000007 -0.0000101 0.1595687 0.0309364 -0.0721399 -0.000003 -0.0973758 -0.0712484 -0.0000123 -0.0000049 -0.0000124 0.1594262 -0.1232674 -0.0150334 0.0000019 -0.0153349 0.0932879 -0.0000036 0.0000014 -0.0000034 0.1601141 0.0262373 0.0125279 0.0707765 -0.0046339 0.0862294 0.0666664 0.1117924 0.0307556 -0.015134 0.0261473 0.0123644 -0.0708285 -0.0049671 0.0860801 -0.0668645 -0.1118563 -0.0308946 -0.0147765 0.0944684 -0.0687176 0.0000727 0.0128998 -0.0610741 0.0001697 -0.0000194 0.0001841 0.1297583 unknown
polarizability: 189.6206869|-0.7115203|108.1979161|-0.0025049|0.0042791|49.8455265 unknown
InChI: InChI=1S/C9H8N2O/c1-7-10-9(12-11-7)8-5-3-2-4-6-8/h2-6H,1H3
charge 0 multiplicity 1
20 atoms
O  1.283203 1.392774 -0.000078
N  1.571994 -0.866158 -0.000061
N  2.73697 1.145774 0.000089
C  -0.787051 0.040283 -0.000028
C  0.669586 0.123144 -0.000026
C  -1.586723 1.21558 0.000036
C  -1.404823 -1.240524 -0.000093
C  2.813099 -0.20824 -0.000084
C  -2.991501 1.105503 0.00004
C  -2.809673 -1.339539 -0.000092
C  -3.606263 -0.169186 -0.000023
C  4.125022 -0.934412 -0.000201
H  -1.102253 2.197038 0.000078
H  -0.770677 -2.132544 -0.000145
H  -3.607456 2.010947 0.00009
H  -3.285047 -2.326084 -0.000145
H  -4.698708 -0.250082 -0.000017
H  4.722626 -0.675873 -0.891007
H  4.723562 -0.67446 0.889553
H  3.934713 -2.01794 0.000714
