program: Gaussian 09
title: 000136935
version: EM64L-G09RevD.01
frameworkgroup: C1[X(C11H12O)]
method: RPBEPBE
basis: SDD
operation: Freq
keyword: #pfreq=noraman
keyword: PBEPBE/SDD
title: #p freq=noraman PBEPBE/SDD
converged: YES YES NO NO
title: Mulliken charges:
elementType: O C C C C C C C C C C C H H H H H H H H H H H H
charge: -0.437688 -0.363140 -0.363324 -0.132343 -0.462660 -0.462748 0.317662 0.316307 -0.469563 -0.469598 -0.229847 -0.229783 0.264104 0.264156 0.237766 0.230217 0.233994 0.234071 0.230213 0.248486 0.248480 0.344719 0.225260 0.225258
chargesum: 0.00000
title: Mulliken charges with hydrogens summed into heavy atoms:
elementType: O C C C C C C C C C C C
charge: -0.092968 -0.099036 -0.099168 0.105423 0.001551 0.001536 0.317662 0.316307 -0.221077 -0.221118 -0.004587 -0.004525
polarizability: 1.40275501e+02 -4.78337769e-01 1.10016670e+02 3.97700501e+00 3.47987754e+00 8.03309802e+01
1716.lowfreq: -19.1580 -7.7906 -0.0005 -0.0001 0.0004 14.0119 104.4766 148.8071 217.4210
frequency: 104.4329 148.7968 217.4163 230.6033 289.0777 349.3267 353.6015 422.8927 454.1433 515.6624 521.9088 574.7406 582.3381 679.6991 711.4862 764.0455 781.3782 789.6148 810.5880 851.2367 875.2073 884.1579 885.9291 924.9789 946.4886 955.4856 987.3133 998.8668 1014.9558 1027.8622 1030.4341 1089.0795 1112.9052 1134.3336 1137.9554 1156.3075 1168.8488 1196.9619 1203.5805 1206.9261 1230.9588 1254.3874 1269.3136 1281.6379 1298.1771 1312.0723 1386.6057 1397.0172 1448.2884 1456.3932 1464.4272 1481.0705 1593.9210 1621.5498 3005.6239 3020.1583 3068.7051 3070.1057 3089.2363 3090.7319 3097.1138 3120.8994 3128.7475 3141.3200 3159.6550 3522.6447
redmass: 4.7325 3.3305 4.0947 1.9099 2.9520 3.3016 1.6260 2.0487 3.5899 4.9589 4.1751 3.8526 4.5754 4.9918 4.2366 1.2494 4.4830 1.6642 3.2098 1.7700 3.0799 1.3744 4.0213 2.1348 1.4270 2.5363 1.3144 3.7664 2.3244 1.6100 2.6974 2.2631 1.2337 1.6161 1.2614 2.1317 1.0856 1.4047 1.7147 1.1834 1.6238 1.4088 1.5809 1.4885 1.6906 1.4749 1.1958 4.7766 2.3564 2.4316 1.0919 1.1665 6.5198 7.3729 1.0603 1.0627 1.1037 1.0877 1.0885 1.1034 1.0940 1.0852 1.0897 1.0947 1.1002 1.0648
irintensity: 0.6557 0.0006 7.7653 0.0175 4.5150 0.4430 31.6512 62.7323 11.8980 2.8330 0.0563 8.3592 0.8061 3.4226 2.6275 61.0950 1.8682 23.2096 0.0045 6.0308 1.9518 0.1564 5.5764 1.7295 1.1029 5.1782 0.0563 1.6572 11.2642 5.6163 106.4341 0.0380 26.8912 4.2705 35.2342 1.4630 0.7171 0.7493 0.4347 0.7969 9.2308 0.1891 38.0168 3.0525 1.7338 3.3743 35.8735 2.1641 3.5634 13.1470 5.5244 15.0958 0.0012 0.1469 27.7192 64.9976 1.8839 21.6217 42.0436 35.5048 43.0140 1.6873 4.1226 33.5143 31.5049 3.6330
temp: 298.150 k
press: 1.00000 atm
elementType: 8 6 6 6 6 6 6 6 6 6 6 6 1 1 1 1 1 1 1 1 1 1 1 1
symmnumber: 1
zpe: 526969.0 jmol-1
zpe.correction: 0.200712 hartree
zpe.thermalcorrener: 0.209845 hartree
zpe.thermalcorrenthalpy: 0.210789 hartree
zpe.thermalcorrgfe: 0.166846 hartree
zpe.sumelectzpe: -500.710723 hartree
zpe.sumelectthermal: -500.701590 hartree
zpe.sumelectthermalent: -500.700646 hartree
zpe.sumelectthermalfe: -500.744589 hartree
dipole: 0.7866 0.2182 -1.9224
dipole: 2.0886
quadrupole: -66.9035 -65.8449 -78.3693
quadrupole: -0.7303 6.2673 1.4586
quadrupole: 3.4691 4.5277 -7.9967 -0.7303 6.2673 1.4586
hfenergy: -500.9114346 hartree
pointgroup: C01 [X(C11H12O1)]
dipole: 0.2992771 0.0349096 0.7644693 debye
dipolederiv: -0.198222 0.0068723 0.130472 -0.0009416 -0.5248439 -0.018225 -0.047837 -0.0174979 -0.9596498 -0.0606545 0.0813831 -0.0678671 0.1466063 0.0933355 0.0910942 0.1034359 0.0893897 -0.0999706 -0.0617016 -0.086211 -0.0604628 -0.1367598 0.0774594 -0.1056904 0.1168047 -0.1045742 -0.0836759 0.3154422 -0.0017816 -0.0362499 0.0026178 0.275247 0.0215803 0.0713995 0.0213031 0.8035283 0.0591685 0.008994 0.0338567 -0.0532036 -0.004689 0.0019454 -0.0336101 -0.052455 0.0562996 0.0596174 -0.0062287 0.0344104 0.0494414 0.0000327 0.0030322 -0.0382669 0.0572161 0.0512909 0.1905939 0.0496178 -0.0107562 0.2459724 -0.0830208 -0.0110446 -0.1070473 -0.03004 -0.1065972 0.1891748 -0.0511631 -0.0068413 -0.2547432 -0.0790483 0.0088037 -0.0869372 0.0286318 -0.1103235 -0.0781368 -0.0277961 0.0189783 -0.0459805 0.1177024 -0.0086791 0.0111709 -0.0149106 -0.1524152 -0.0774034 0.0295893 0.016776 0.0476923 0.1173082 -0.0151235 0.0072098 -0.0088633 -0.1527635 0.0348563 -0.0462221 0.0077859 -0.081596 -0.016946 -0.0076903 0.0124579 -0.0008867 -0.158191 0.0349738 0.0468254 0.003565 0.0822041 -0.0179227 -0.0045946 0.0048112 -0.0116133 -0.1578538 0.028381 -0.0109204 0.0031443 -0.0535012 -0.1292968 -0.0521378 -0.0115567 -0.0606159 0.0542059 0.028453 0.0108573 0.0024597 0.0521478 -0.1186699 0.0669002 -0.0158693 0.0754389 0.0432781 -0.1777029 0.00077 0.0131954 0.0000278 0.0755758 -0.0020346 -0.0053668 -0.0020314 0.0246315 0.0392274 0.0653618 -0.1061415 0.021113 0.0164689 0.0580788 -0.0636424 0.0666602 -0.0806494 -0.1821373 -0.1097704 0.0702576 -0.0511575 0.0267287 0.0171935 0.0642156 0.0163913 0.0554484 -0.1814367 0.1158678 0.0608937 0.057251 0.0234792 -0.0149242 0.0599591 -0.0139402 0.0581744 0.0387514 -0.074351 -0.100493 -0.0267287 0.0054763 -0.0649581 -0.0620345 -0.0736444 -0.0692516 0.0825196 -0.017592 -0.0047116 0.017099 -0.1091908 0.0103959 -0.008828 0.0113983 0.1480802 0.0824595 0.0167444 -0.0060542 -0.0182725 -0.1091094 0.0120089 -0.0070012 0.0111989 0.1479134 0.0334682 -0.0007383 0.0132691 0.0007964 0.2952193 0.0032094 0.0455693 0.0026441 0.3735591 -0.0996216 0.0915271 -0.0087825 0.096321 0.0342193 0.0068786 -0.0086883 0.0055409 0.1573909 -0.1000704 -0.0916357 -0.0007041 -0.0964057 0.0344848 0.0039812 -0.0003482 0.0052596 0.1575411 unknown
polarizability: 140.3718776|-0.1532226|110.3604368|-3.1932345|-1.3386208|79.8908367 unknown
InChI: InChI=1S/C11H12O/c12-11-9-5-6-10(11)8-4-2-1-3-7(8)9/h1-4,9-12H,5-6H2
charge 0 multiplicity 1
24 atoms
O  -1.471346 -0.088789 -2.274549
C  -1.15801 -1.144507 0.047373
C  -1.155794 1.159677 -0.050992
C  -1.794934 -0.028216 -0.85917
C  -1.746931 -0.719972 1.442533
C  -1.744501 0.85663 1.375205
C  0.304747 -0.707667 0.031515
C  0.306334 0.720356 -0.030182
C  1.509707 -1.425074 0.114769
C  1.512999 1.439486 -0.009776
C  2.731408 -0.699639 0.119912
C  2.733032 0.714323 0.058034
H  -1.362968 -2.184961 -0.24501
H  -1.359072 2.172016 -0.430317
H  -2.897238 -0.025965 -0.824368
H  -1.137532 -1.108951 2.274958
H  -2.773419 -1.112081 1.559265
H  -2.769535 1.26057 1.459608
H  -1.132681 1.313077 2.170831
H  1.514991 -2.519896 0.165972
H  1.520986 2.534609 -0.053821
H  -0.482933 -0.089122 -2.371681
H  3.684204 -1.239212 0.167934
H  3.687086 1.253811 0.058555
