program: Gaussian 09
title: 000136926
version: EM64L-G09RevD.01
frameworkgroup: C1[X(C4H9N)]
method: RPBEPBE
basis: SDD
operation: Freq
keyword: #p
keyword: freq=noraman
keyword: PBEPBE/SDD
title: #p freq=noraman PBEPBE/SDD
converged: YES YES NO NO
title: Mulliken charges:
elementType: N C C C C H H H H H H H H H
charge: -0.023662 -0.382389 -0.662302 -0.150521 -0.703689 0.221034 0.171255 0.207217 0.217836 0.232882 0.183459 0.220344 0.221404 0.247132
chargesum: 0.00000
title: Mulliken charges with hydrogens summed into heavy atoms:
elementType: N C C C C
charge: -0.023662 0.009900 -0.004367 0.032938 -0.014810
polarizability: 7.20780205e+01 6.25350867e-01 4.18495106e+01 -5.05366082e+00 2.58712850e+00 4.33423700e+01
1716.lowfreq: -0.0005 0.0006 0.0008 1.9114 4.0701 16.0416 89.0775 172.2754 202.0409
frequency: 88.8876 172.2740 202.0363 211.6105 313.7869 429.5839 510.6216 801.4013 834.3761 877.4041 949.3453 1053.6546 1069.8403 1094.5330 1114.7879 1161.9862 1252.9776 1327.5226 1362.5400 1385.0986 1386.9301 1453.9195 1460.8104 1462.5254 1467.6792 1488.3474 1662.3317 2887.6470 2895.5220 2974.8273 2988.5575 3012.8931 3050.9785 3087.0122 3095.5153 3113.6234
redmass: 2.1252 1.4199 1.9441 1.1660 1.9415 3.1416 2.6503 1.2816 1.6874 1.1829 1.9938 3.2095 1.6181 2.0190 1.7072 1.9797 1.1329 1.2459 1.3009 1.2086 1.3249 1.0637 1.0485 1.0468 1.0665 1.0655 6.7835 1.0760 1.0765 1.0379 1.0351 1.0909 1.0965 1.1001 1.1004 1.0989
irintensity: 7.3825 0.7276 0.8843 0.9038 5.4470 13.8091 2.7973 3.9478 1.6473 16.7632 10.1979 7.2238 0.7224 4.9390 3.7192 6.3244 1.7399 10.8224 11.0766 14.2925 20.9349 24.4515 17.8541 17.0795 5.1998 8.1779 55.3111 17.8121 177.2417 21.5052 31.6630 23.5115 24.0162 47.9329 36.5717 18.7448
temp: 298.150 k
press: 1.00000 atm
elementType: 7 6 6 6 6 1 1 1 1 1 1 1 1 1
symmnumber: 1
zpe: 321217.6 jmol-1
zpe.correction: 0.122345 hartree
zpe.thermalcorrener: 0.128997 hartree
zpe.thermalcorrenthalpy: 0.129941 hartree
zpe.thermalcorrgfe: 0.092550 hartree
zpe.sumelectzpe: -212.132117 hartree
zpe.sumelectthermal: -212.125465 hartree
zpe.sumelectthermalent: -212.124521 hartree
zpe.sumelectthermalfe: -212.161912 hartree
dipole: -0.2790 0.8789 1.3623
dipole: 1.6450
quadrupole: -28.0469 -32.2921 -33.1451
quadrupole: 0.4856 -0.9580 -0.2766
quadrupole: 3.1145 -1.1307 -1.9838 0.4856 -0.9580 -0.2766
hfenergy: -212.2544622 hartree
pointgroup: C01 [X(C4H9N1)]
dipole: -0.1172495 -0.4738768 -0.4249087 debye
dipolederiv: -0.5741233 0.0354302 0.0114754 -0.1790489 -0.4016021 -0.0568984 -0.1197438 -0.0187141 -0.4042181 0.3166867 -0.0564733 0.0086519 -0.063648 0.3076854 0.0442404 -0.0023785 0.0784422 0.2864559 -0.0157367 -0.0589263 0.0230362 0.0285117 0.0115922 0.0440384 0.0560764 0.0056388 0.0595134 0.6190591 -0.0839914 0.1437486 -0.0974142 0.3056407 0.2712686 0.1349918 0.2821719 0.1553403 -0.320038 0.0996114 -0.0241173 0.0824494 0.0002973 -0.0324922 -0.0540664 -0.0320064 0.046023 -0.0165675 0.0250515 -0.050761 0.0757223 0.0449758 0.0639216 -0.0532461 0.0979029 -0.1181783 -0.070748 -0.049446 -0.0364238 0.0816967 -0.1943826 -0.1162809 0.0651997 -0.1847305 -0.0282932 -0.18967 0.0824519 0.0138176 0.0988743 0.034659 0.0025158 0.0261652 0.0111212 0.1030331 0.0676626 0.0131883 -0.0764361 -0.0258214 0.0585779 0.065025 -0.0217216 0.0851696 -0.1351336 0.1159922 -0.0034299 0.0112295 -0.0506068 -0.0785247 -0.091585 -0.0259713 -0.1200392 0.0122236 -0.0224447 0.0752957 0.0053561 0.020151 -0.1387835 -0.2186142 -0.0441405 -0.2050023 -0.0048725 0.041613 0.0307633 -0.0512169 0.0838387 0.093724 0.0520787 -0.0786346 0.0703837 -0.1045026 -0.0541222 -0.0801997 0.049508 -0.0937345 -0.0129333 0.0712951 0.0934252 0.0477077 0.0979819 0.1024369 -0.0293256 -0.0278682 0.0390296 -0.0309259 -0.0985128 0.0240446 -0.1180454 0.034627 unknown
polarizability: 71.9725455|-0.0330957|43.2750943|5.4592697|2.4668005|42.0222613 unknown
InChI: InChI=1S/C4H9N/c1-3-5-4-2/h3H,4H2,1-2H3
charge 0 multiplicity 1
14 atoms
N  -0.044315 0.085508 0.542068
C  1.250979 -0.615183 0.381366
C  2.306337 0.353564 -0.191503
C  -1.077662 -0.356907 -0.111931
C  -2.431152 0.302778 -0.014019
H  1.574405 -0.943933 1.388344
H  1.177775 -1.523729 -0.264612
H  3.300683 -0.128263 -0.221281
H  2.03867 0.667762 -1.216044
H  2.37271 1.25869 0.43693
H  -1.017699 -1.250717 -0.779441
H  -2.783942 0.623755 -1.013262
H  -3.184632 -0.407822 0.377965
H  -2.380755 1.178996 0.651719
