program: Gaussian 09
title: 000136949
version: EM64L-G09RevD.01
frameworkgroup: C1[X(C17H16N2)]
method: RPBEPBE
basis: SDD
operation: Freq
keyword: #pfreq=noraman
keyword: PBEPBE/SDD
title: #p freq=noraman PBEPBE/SDD
converged: YES YES NO NO
title: Mulliken charges:
elementType: N N C C C C C C C C C C C C C C C C C H H H H H H H H H H H H H H H H
charge: -0.147458 -0.052526 0.402781 0.499598 -0.376878 -0.379099 -0.449827 -0.334268 -0.383686 0.234371 0.355632 -0.644259 -0.645517 -0.394877 -0.369454 -0.241118 -0.235195 -0.248411 -0.311827 0.239242 0.241838 0.221581 0.253893 0.216031 0.238528 0.220562 0.238331 0.219537 0.241229 0.240653 0.219768 0.250586 0.223961 0.227073 0.229205
chargesum: 0.00000
title: Mulliken charges with hydrogens summed into heavy atoms:
elementType: N N C C C C C C C C C C C C C C C C C
charge: -0.147458 -0.052526 0.402781 0.499598 -0.137636 -0.137261 -0.228246 -0.080375 -0.167655 0.234371 0.355632 0.053162 0.055902 -0.175108 -0.118868 -0.017157 -0.008122 -0.019206 -0.311827
polarizability: 4.80238609e+02 1.01913792e+01 2.00664544e+02 -1.84266113e+00 -3.05530729e+00 8.90567081e+01
1716.lowfreq: -9.6886 -3.4774 -0.0006 -0.0005 0.0007 4.5840 22.3428 31.4711 43.8075
frequency: 22.2940 31.4611 43.8019 69.6087 76.8594 100.8227 119.0703 140.3972 156.7061 180.4418 194.1070 215.8360 255.5189 287.5132 314.8194 370.4341 388.4676 393.6067 403.2791 425.6451 466.9089 478.5565 490.4473 530.8778 541.3933 616.3541 627.6908 645.4172 656.2371 694.5694 719.8697 742.7537 770.6956 774.0985 804.6769 825.0165 828.0893 844.4343 913.7643 918.7080 941.3455 957.4173 972.0465 974.3554 986.3416 989.5855 993.3528 997.7401 1034.1944 1055.6934 1090.9452 1104.7467 1110.8856 1142.6597 1167.3509 1174.0925 1199.0202 1211.3822 1234.0690 1256.8034 1274.0191 1315.7972 1335.9850 1353.8746 1371.1979 1380.7032 1393.6122 1430.3549 1439.5251 1454.1054 1458.5139 1465.3456 1477.6177 1484.9836 1491.7439 1504.9717 1528.4665 1544.9076 1578.8046 1585.8067 1611.2666 1633.1319 2142.7459 2947.8566 2955.2579 3015.7309 3020.6893 3101.1566 3104.0107 3111.1701 3115.0072 3123.4089 3129.9669 3142.1369 3150.0387 3160.3394 3165.8681 3166.8603 3187.0525
redmass: 3.3784 4.7126 4.7162 4.8130 2.3373 3.8690 1.6104 6.6724 5.0656 2.9051 1.1646 4.3909 2.9442 3.7559 5.4774 5.1736 4.0652 3.8813 2.8605 3.0982 5.1265 4.0830 3.5221 2.4298 3.8496 6.4160 7.2159 4.7818 6.5246 1.7671 5.1485 3.3217 3.5422 2.5621 1.3050 2.8248 2.2480 1.3097 1.3692 1.5122 3.1737 1.4456 1.3614 1.4003 5.1488 4.7418 1.3532 3.1596 2.0132 1.5116 1.6244 1.2380 1.3276 1.6117 1.6837 1.0527 1.1450 1.2410 1.8192 2.8127 3.4558 1.5327 1.4687 1.8989 2.9370 7.0193 2.4596 1.2134 2.3033 2.6579 1.3036 1.0409 1.0458 2.1903 1.1266 1.1466 2.6856 5.1936 5.0683 6.2763 6.0834 6.1224 12.6229 1.0368 1.0389 1.1003 1.1022 1.0966 1.0874 1.0946 1.0892 1.0844 1.0870 1.0918 1.0961 1.0878 1.1015 1.0930 1.0947
irintensity: 0.0541 2.3688 0.4007 1.4189 0.0409 4.2161 1.5394 3.0199 2.1335 1.1845 0.0355 0.1224 1.4597 0.8539 0.9287 0.8623 1.1770 1.8327 0.1012 0.1632 4.2657 2.8840 4.4079 29.3069 19.4647 0.0888 1.0631 2.5785 13.0372 49.2816 3.0993 4.3527 17.6897 33.0282 9.9878 16.8256 49.1912 1.1486 20.7739 0.7321 29.8921 4.9255 0.2159 0.0522 4.0284 6.2885 0.2502 9.4630 3.3367 25.0664 6.8242 0.0283 1.0322 3.6519 10.4626 0.2988 15.7358 141.3490 3.3794 24.1996 9.9152 9.0623 8.6795 10.2988 243.7884 22.5022 97.3068 13.4728 13.8353 24.8790 17.8608 0.0274 23.9190 16.9860 5.2471 40.3257 390.1524 2.7616 148.3820 215.1392 6.5169 435.6757 89.5937 96.1033 170.1803 19.5446 58.1043 4.0515 12.7758 49.9788 13.4020 5.5446 1.1281 12.2973 32.9609 10.6617 41.6852 19.3280 8.0097
temp: 298.150 k
press: 1.00000 atm
elementType: 7 7 6 6 6 6 6 6 6 6 6 6 6 6 6 6 6 6 6 1 1 1 1 1 1 1 1 1 1 1 1 1 1 1 1
symmnumber: 1
zpe: 738869.3 jmol-1
zpe.correction: 0.281420 hartree
zpe.thermalcorrener: 0.299028 hartree
zpe.thermalcorrenthalpy: 0.299972 hartree
zpe.thermalcorrgfe: 0.234086 hartree
zpe.sumelectzpe: -765.554730 hartree
zpe.sumelectthermal: -765.537123 hartree
zpe.sumelectthermalent: -765.536179 hartree
zpe.sumelectthermalfe: -765.602065 hartree
dipole: -5.6448 -3.9457 -0.1403
dipole: 6.8885
quadrupole: -67.7256 -112.6903 -119.1166
quadrupole: -5.3255 -1.0164 -1.3788
quadrupole: 32.1186 -12.8461 -19.2724 -5.3255 -1.0164 -1.3788
hfenergy: -765.8361509 hartree
pointgroup: C01 [X(C17H16N2)]
dipole: 2.1681585 1.1065686 -1.191417 debye
polarizability: 478.6259867|24.5805151|143.8269835|-3.9407503|-56.0931613|147.506891 unknown
InChI: InChI=1S/C17H16N2/c1-19(2)17-10-8-14(9-11-17)12-16(13-18)15-6-4-3-5-7-15/h3-12H,1-2H3
charge 0 multiplicity 1
35 atoms
N  5.154052 0.122066 -0.089816
N  -1.15801 -2.20147 2.313319
C  3.762622 0.092605 -0.14683
C  0.865258 0.022985 -0.253397
C  3.040841 0.801307 -1.163621
C  2.9923 -0.648721 0.811256
C  1.642598 0.759274 -1.203332
C  1.594475 -0.680758 0.757616
C  -0.582416 0.062901 -0.398617
C  -1.611013 -0.540205 0.31651
C  -3.054817 -0.322879 -0.001956
C  5.917488 0.893894 -1.081041
C  5.86735 -0.615182 0.964168
C  -3.494329 0.778419 -0.792204
C  -4.041841 -1.222772 0.492672
C  -4.859276 0.953861 -1.096405
C  -5.407876 -1.043593 0.190999
C  -5.826883 0.042688 -0.610319
C  -1.342143 -1.441797 1.403998
H  3.575349 1.382556 -1.91964
H  3.494515 -1.205307 1.607099
H  1.121495 1.313442 -1.994893
H  1.062594 -1.262201 1.514173
H  -0.913116 0.682336 -1.2439
H  5.737723 0.52847 -2.112084
H  6.993685 0.797042 -0.870301
H  5.659153 1.971472 -1.04902
H  6.951995 -0.472336 0.840589
H  5.659051 -1.702555 0.915934
H  5.588794 -0.257157 1.975337
H  -2.775512 1.523503 -1.150157
H  -3.733766 -2.071809 1.113158
H  -5.17166 1.812334 -1.701863
H  -6.144762 -1.753939 0.582135
H  -6.887719 0.184427 -0.843868
