program: Gaussian 09
title: 000136919
version: EM64L-G09RevD.01
frameworkgroup: C1[X(CF2N2O4)]
method: RPBEPBE
basis: SDD
operation: Freq
keyword: #pfreq=noraman
keyword: PBEPBE/SDD
title: #p freq=noraman PBEPBE/SDD
converged: NO NO NO NO
title: Mulliken charges:
elementType: F F O O O O N N C
charge: -0.083742 -0.083590 -0.118107 -0.118143 -0.118120 -0.118121 0.089363 0.089381 0.461079
chargesum: 0.00000
title: Mulliken charges with hydrogens summed into heavy atoms:
polarizability: 4.69446783e+01 -1.91493555e-03 5.96775885e+01 6.55014529e-04 -8.51014795e-02 2.95952414e+01
1716.lowfreq: -1.5671 0.0015 0.0016 0.0017 12.8346 16.5747 17.0372 49.2208 144.3824
frequency: 5.3696 49.2183 144.3824 241.7623 244.4115 316.2690 338.8094 394.3160 479.7224 510.6393 535.6872 695.8970 711.6384 748.0166 801.8311 1046.0242 1151.4479 1169.5378 1190.7549 1440.7888 1469.3726
redmass: 16.0159 16.2489 15.9704 18.0747 16.8305 16.9993 16.8241 15.8415 13.7618 16.2272 16.8052 14.9734 15.1075 15.4370 12.9476 13.5141 15.1689 12.9762 15.0687 14.6206 14.6167
irintensity: 0.0000 0.2549 2.5855 0.0000 3.1715 5.1756 0.0024 0.0000 0.0035 20.8747 0.9429 0.0745 94.7474 21.1149 1.8547 171.3898 174.6438 93.7560 25.3045 0.0295 298.5915
temp: 298.150 k
press: 1.00000 atm
elementType: 9 9 8 8 8 8 7 7 6
symmnumber: 1
zpe: 81859.8 jmol-1
zpe.correction: 0.031179 hartree
zpe.thermalcorrener: 0.039664 hartree
zpe.thermalcorrenthalpy: 0.040608 hartree
zpe.thermalcorrgfe: -0.005313 hartree
zpe.sumelectzpe: -647.272757 hartree
zpe.sumelectthermal: -647.264272 hartree
zpe.sumelectthermalent: -647.263328 hartree
zpe.sumelectthermalfe: -647.309249 hartree
dipole: 0.0008 0.0065 1.2868
dipole: 1.2868
quadrupole: -52.4508 -54.9219 -48.4457
quadrupole: 0.0003 0.0014 0.0174
quadrupole: -0.5113 -2.9824 3.4938 0.0003 0.0014 0.0174
hfenergy: -647.3039357 hartree
pointgroup: C01 [X(C1F2N2O4)]
dipole: 0.0000624 -0.0053553 0.5062554 debye
dipolederiv: -0.2533845 -0.0001779 -0.0001923 -0.0002092 -0.4664067 -0.274139 -0.0001407 -0.2531973 -0.5164053 -0.2534352 0.0001341 -0.0001407 0.0001584 -0.4769615 0.274939 -0.0000941 0.2539982 -0.5059761 -0.3763401 -0.1389796 0.1320924 -0.1260939 -0.6001421 0.0033973 0.2619332 0.1067344 -0.2247598 -0.3773562 -0.1371909 -0.1340895 -0.1227416 -0.5981002 -0.0092824 -0.2647957 -0.1131036 -0.2265134 -0.3770353 0.1373656 0.1343674 0.1223634 -0.5979645 -0.0095187 0.2645161 -0.112897 -0.2267623 -0.3766263 0.1388179 -0.1317881 0.1264941 -0.6003425 0.0030778 -0.2621776 0.10691 -0.2244759 0.8790889 0.0022896 -0.3657769 0.0069166 1.1318543 0.0071854 -0.8547545 0.0071818 0.2561161 0.8803441 -0.0023381 0.3649837 -0.0069675 1.1321924 0.007277 0.854519 0.0071863 0.2550685 0.2547445 0.0000794 0.0005439 0.00008 1.0758706 -0.0029364 0.0009943 -0.0028128 1.4137083 unknown
polarizability: 46.9446685|-0.0005147|59.6757186|-0.0129225|0.2519872|29.5971211 unknown
InChI: InChI=1S/CF2N2O4/c2-1(3,4(6)7)5(8)9
charge 0 multiplicity 1
9 atoms
F  0.000882 1.123795 1.390727
F  0.000714 -1.151315 1.367917
O  1.71629 1.157287 -0.66329
O  -1.71938 -1.143805 -0.68107
O  1.718878 -1.144019 -0.682943
O  -1.716654 1.15752 -0.661193
N  1.287699 0.003273 -0.337771
N  -1.288524 0.003439 -0.33566
C  0.000296 -0.006075 0.603183
