program: Gaussian 09
title: 000011810
version: EM64L-G09RevD.01
frameworkgroup: C1[X(C8H5Cl5)]
method: RPBEPBE
basis: SDD
operation: Freq
keyword: #pfreq=noraman
keyword: PBEPBE/SDD
title: #p freq=noraman PBEPBE/SDD
converged: NO NO NO NO
title: Mulliken charges:
elementType: Cl Cl Cl Cl Cl C C C C C C C C H H H H H
charge: 0.019660 0.019658 0.054016 0.054017 0.060616 0.790765 -0.527396 -0.358698 -0.358629 -0.659796 -0.079747 -0.079705 -0.103205 0.239309 0.239298 0.230465 0.228909 0.230463
chargesum: 0.00000
title: Mulliken charges with hydrogens summed into heavy atoms:
elementType: Cl Cl Cl Cl Cl C C C C C C C C
charge: 0.019660 0.019658 0.054016 0.054017 0.060616 0.790765 -0.048790 -0.358698 -0.358629 0.030042 -0.079747 -0.079705 -0.103205
polarizability: 1.72405970e+02 1.62383565e-03 1.74190935e+02 3.69433252e+00 -1.93186979e-03 6.00232189e+01
1716.lowfreq: -6.5428 -0.0003 0.0031 0.0033 0.2609 9.0408 59.0081 61.3730 70.2927
frequency: 59.0024 61.3645 70.2898 85.1072 137.1347 203.6313 204.4083 211.4954 213.5930 222.0406 234.0758 307.2282 319.2036 329.1762 344.0692 350.6508 374.2940 459.5621 587.2868 593.7282 621.7085 630.2718 691.2074 767.8246 794.9686 813.9257 870.8526 983.4140 1056.6179 1072.4200 1072.7185 1219.9173 1245.4044 1309.0554 1328.2871 1342.3233 1353.1474 1392.0379 1473.2449 1474.0957 1485.4153 1522.5379 1547.4342 2989.4801 3024.2912 3075.5338 3089.3177 3099.8027
redmass: 5.8585 6.3469 4.8190 13.3919 7.6359 6.0663 17.1608 24.0781 2.2170 2.4331 6.5877 24.6325 21.8904 12.4626 2.5575 24.8428 8.5474 5.7938 4.8114 11.8198 10.9237 8.8141 7.3341 9.0197 1.4907 4.2057 4.8499 3.1510 3.1842 2.9000 1.5191 8.9195 1.3918 1.3559 8.3931 4.6421 8.6660 1.2243 1.0670 1.0411 1.0738 9.4212 11.1772 1.0349 1.0600 1.1011 1.0998 1.1026
irintensity: 0.0406 0.4856 0.0883 0.1625 0.0785 0.1757 0.1539 0.1875 0.0345 0.0011 0.4312 0.2129 0.0749 0.0000 1.5528 0.2418 1.6660 6.0688 0.9686 0.0031 57.1395 1.7068 45.8049 2.8817 18.5911 1.8899 0.4963 0.5645 0.1730 42.4084 19.5952 32.1969 20.7317 2.9941 106.6517 35.8522 76.4168 16.4511 6.4618 13.5110 15.2797 0.2708 3.9943 30.4890 14.5136 0.8813 35.6882 19.4754
temp: 298.150 k
press: 1.00000 atm
elementType: 17 17 17 17 17 6 6 6 6 6 6 6 6 1 1 1 1 1
symmnumber: 1
zpe: 279415.3 jmol-1
zpe.correction: 0.106424 hartree
zpe.thermalcorrener: 0.120114 hartree
zpe.thermalcorrenthalpy: 0.121058 hartree
zpe.thermalcorrgfe: 0.064371 hartree
zpe.sumelectzpe: -2607.183680 hartree
zpe.sumelectthermal: -2607.169990 hartree
zpe.sumelectthermalent: -2607.169046 hartree
zpe.sumelectthermalfe: -2607.225733 hartree
dipole: -2.1420 0.0010 -0.0056
dipole: 2.1420
quadrupole: -104.6513 -113.8703 -110.1186
quadrupole: -0.0043 0.1613 0.0000
quadrupole: 4.8954 -4.3235 -0.5719 -0.0043 0.1613 0.0000
hfenergy: -2607.290104 hartree
pointgroup: C01 [X(C8H5Cl5)]
dipole: -0.8424512 -0.0003163 -0.0213352 debye
dipolederiv: -0.2333331 0.2769548 -0.0205173 0.27502 -0.538994 0.0368498 -0.015679 0.0269018 -0.0210836 -0.2330207 -0.27677 -0.0205091 -0.274827 -0.5393039 -0.0368873 -0.0157078 -0.0269677 -0.0210953 -0.178782 0.2853651 -0.0140568 0.2926792 -0.5050571 0.0233633 -0.0210464 0.0321822 0.0095797 -0.1784053 -0.2851484 -0.0140389 -0.2924623 -0.5054215 -0.0233664 -0.0210234 -0.0321883 0.0095783 -0.6695046 -0.0002205 -0.0600997 -0.0002255 -0.0080261 -0.0000219 -0.0741753 -0.0000194 0.0084206 0.1617042 0.0002044 -0.0202284 0.0001481 -0.3656319 -0.0000293 0.0184289 -0.0000197 0.0094419 -0.0078463 -0.0000242 0.0276919 0.0000143 0.0406154 -0.0000023 0.1592699 0.0000362 0.0434177 0.2023779 -0.39108 0.0353249 -0.5566707 0.6770949 -0.0570322 0.0028018 -0.0303277 -0.0666831 0.2017752 0.3907421 0.0353185 0.5564096 0.6776458 0.0571078 0.0028399 0.0304458 -0.0666673 -0.0187191 -0.0000315 0.0234393 -0.0000504 0.0749976 0.0000026 -0.124216 -0.000052 0.0198245 0.0221024 -0.4697246 -0.0031634 -0.5387769 0.6304275 -0.0453857 0.0107284 -0.0498293 -0.0135858 0.0214185 0.4693455 -0.0031886 0.5383677 0.6310596 0.0453636 0.0106984 0.0497876 -0.0135885 0.8799085 0.0003747 0.0950191 0.0003814 -0.2673206 0.0000351 0.0931238 0.0000318 -0.0236843 0.029973 0.0193747 0.0050338 0.0626576 -0.0053861 0.1155023 -0.0070968 0.0635275 0.0186745 0.0300564 -0.019344 0.0051375 -0.0626527 -0.005433 -0.1154808 -0.0070185 -0.0635111 0.0187081 0.0951614 0.0698277 -0.0364993 0.0190959 -0.0486595 0.1169741 -0.0142608 0.0612114 0.0111944 -0.2201065 -0.0001263 0.0017321 -0.000131 0.1061569 -0.000003 0.0165384 0.0000006 0.0663155 0.0952401 -0.0697195 -0.0363957 -0.0189775 -0.0487643 -0.1169897 -0.0142054 -0.0612096 0.0112327 unknown
polarizability: 172.1805449|0.0000232|174.1909367|6.23947|0.0025849|60.2486424 unknown
InChI: InChI=1S/C8H5Cl5/c1-2-3-4(9)6(11)8(13)7(12)5(3)10/h2H2,1H3
charge 0 multiplicity 1
18 atoms
Cl -1.305892 2.787415 -0.245782
Cl -1.304175 -2.788025 -0.245875
Cl 1.875867 -2.782232 0.084051
Cl 1.874026 2.783636 0.08403
Cl 3.47929 0.001243 0.251403
C  -1.164089 -0.000315 -0.256468
C  -2.677261 -0.000921 -0.400352
C  -0.422908 1.206889 -0.168833
C  -0.422105 -1.206997 -0.168797
C  -3.392179 -0.001079 0.977385
C  0.982992 -1.221806 -0.015049
C  0.982177 1.222616 -0.015062
C  1.690343 0.000642 0.059545
H  -2.987951 0.890111 -0.972035
H  -2.987224 -0.892329 -0.971867
H  -3.122975 -0.896674 1.564687
H  -4.487449 -0.001528 0.834315
H  -3.123686 0.894854 1.564503
