program: Gaussian 09
title: 000136905
version: EM64L-G09RevD.01
frameworkgroup: C1[X(C10H14S)]
method: RPBEPBE
basis: SDD
operation: Freq
keyword: #pfreq=noraman
keyword: PBEPBE/SDD
title: #p freq=noraman PBEPBE/SDD
converged: YES YES NO NO
title: Mulliken charges:
elementType: S C C C C C C C C C C H H H H H H H H H H H H H H
charge: 0.167181 -0.306868 -0.318806 -0.690590 -0.687611 -0.149405 -0.226397 -0.271114 -0.219808 -0.208844 -0.235021 0.221866 0.198923 0.187074 0.213509 0.245900 0.261547 0.216671 0.205534 0.210844 0.243827 0.253484 0.228527 0.229345 0.230233
chargesum: 0.00000
title: Mulliken charges with hydrogens summed into heavy atoms:
elementType: S C C C C C C C C C C
charge: 0.167181 0.113921 0.081777 -0.183143 -0.054563 -0.149405 0.017430 -0.017630 0.008718 0.020501 -0.004788
polarizability: 1.50254722e+02 -1.95345827e+01 1.13745567e+02 -1.20828039e+01 -1.10852166e+01 9.94654354e+01
1716.lowfreq: -14.4174 0.0021 0.0024 0.0030 1.8955 13.8217 21.4761 25.8038 71.1191
frequency: 19.8430 25.4603 71.0455 89.2348 130.1340 191.8525 236.2458 255.2773 280.0773 314.0252 388.5718 403.9292 456.5023 491.4980 591.9472 611.2295 676.3373 695.5159 740.6801 751.7357 798.2889 846.4594 866.1953 915.1263 920.9934 972.8189 985.8988 993.8864 1012.7863 1015.7692 1062.3984 1067.3689 1073.3325 1079.5817 1106.7240 1170.8191 1180.8140 1198.5786 1221.8456 1273.6911 1288.6506 1298.7323 1303.2831 1357.6113 1371.8382 1388.4945 1423.9834 1435.7988 1455.2561 1458.0506 1474.4901 1478.8007 1485.6516 1584.3202 1587.9372 2957.3800 2970.4699 2971.7307 3009.4388 3019.2482 3036.3000 3068.6008 3071.9643 3088.4187 3124.5787 3132.0018 3144.7896 3153.9998 3166.9100
redmass: 3.8658 3.7823 1.7839 3.1840 3.3547 3.3861 1.1313 2.5865 3.6844 2.9551 7.3335 2.9071 2.7746 3.3545 4.5242 6.3989 6.7015 2.1277 1.1570 1.5184 1.7867 1.2448 1.3436 1.3821 1.4134 1.4051 6.0187 1.3157 2.6381 3.1496 1.9468 1.5332 2.3875 1.4413 2.0451 1.0534 1.1171 1.3992 1.3521 1.2102 1.1393 1.3186 1.2619 1.5997 8.8274 1.2140 2.0439 1.1102 1.0778 2.0894 1.0587 1.0430 1.0759 6.2506 6.0195 1.0620 1.0534 1.0451 1.0802 1.0733 1.0994 1.1007 1.0994 1.1061 1.0846 1.0879 1.0929 1.0963 1.1015
irintensity: 0.0769 0.4435 0.1412 0.9948 0.3759 1.2683 0.0304 0.2713 0.2031 0.0488 0.3242 0.2801 3.7169 11.9108 1.4848 0.2630 9.1785 40.0641 10.7605 72.0831 2.0387 0.3447 7.5214 7.6871 9.9206 0.0749 2.8662 0.1017 5.7638 13.4601 4.2398 6.0082 3.0190 6.6877 1.9820 0.0196 0.4661 3.1175 1.7699 9.1830 10.4576 1.9478 3.1965 1.6721 0.1469 11.6488 5.9276 15.0109 4.8178 30.2957 3.7014 11.7828 14.4408 2.1012 14.0456 21.0142 54.2782 22.5746 6.0130 19.9749 26.1024 73.7183 52.2377 21.1109 1.4361 2.8527 18.2235 28.4770 18.4622
temp: 298.150 k
press: 1.00000 atm
elementType: 16 6 6 6 6 6 6 6 6 6 6 1 1 1 1 1 1 1 1 1 1 1 1 1 1
symmnumber: 1
zpe: 553232.5 jmol-1
zpe.correction: 0.210715 hartree
zpe.thermalcorrener: 0.222648 hartree
zpe.thermalcorrenthalpy: 0.223592 hartree
zpe.thermalcorrgfe: 0.170307 hartree
zpe.sumelectzpe: -786.683006 hartree
zpe.sumelectthermal: -786.671073 hartree
zpe.sumelectthermalent: -786.670129 hartree
zpe.sumelectthermalfe: -786.723414 hartree
dipole: -0.0157 0.7885 1.7361
dipole: 1.9069
quadrupole: -68.8888 -73.1813 -75.0897
quadrupole: -3.8289 -1.9333 -5.9233
quadrupole: 3.4978 -0.7947 -2.7031 -3.8289 -1.9333 -5.9233
hfenergy: -786.8937214 hartree
pointgroup: C01 [X(C10H14S1)]
dipole: -0.0082422 -0.2542342 -0.7057781 debye
dipolederiv: -0.3154857 0.0052858 0.0639941 -0.1305916 -0.2402609 0.0145948 0.0914516 0.0169661 -0.0503564 0.0055765 0.0460358 0.0063505 0.0092221 -0.0236075 -0.0050919 0.1098691 -0.0606736 0.017274 0.1324458 0.0714693 -0.0128635 0.078267 0.0825836 -0.0159698 0.0127003 -0.009793 0.0445886 0.2513642 -0.0186323 -0.2018766 0.0409709 0.1294451 0.0137866 -0.3553218 0.0277057 0.1875863 0.0304858 0.059593 -0.003218 0.0527854 -0.0200208 -0.0260025 -0.0242825 -0.0161708 0.0929367 0.5126584 0.2256137 0.1487473 0.3059942 0.0943636 0.0304333 0.2204246 0.0093349 -0.1081671 -0.2350019 0.0148886 -0.035673 -0.0839312 -0.005706 -0.0768206 -0.1014659 -0.0883382 -0.1159818 -0.2415902 -0.1203513 0.0572699 -0.0765749 -0.0994512 -0.0540438 0.0310965 -0.0746539 -0.0373153 -0.007285 -0.0204209 0.1176525 0.0113319 -0.009239 -0.0726333 0.1004365 -0.0957007 -0.0133217 -0.0478119 0.0814369 0.019405 0.0644662 0.0858282 -0.0921727 0.0567403 -0.0615858 -0.060995 -0.018136 0.0796465 0.0922262 0.0681189 -0.0603225 -0.0010003 0.0650967 -0.0086964 -0.0958964 -0.0243537 -0.0871297 -0.0597834 -0.098254 -0.0461967 -0.0353276 -0.0687375 0.006437 0.0662742 -0.0344806 0.0075523 0.1283817 0.0778297 0.059034 -0.0006024 0.1120876 0.039321 -0.1426048 -0.0884841 -0.0936898 -0.0497499 -0.1319518 -0.1008531 -0.0388449 -0.0283303 -0.0143789 0.0660659 0.0618332 -0.0074735 0.1038806 -0.0229171 0.0477679 0.0088101 0.0705184 0.0146193 -0.1053742 -0.0843596 -0.1377259 -0.0011987 -0.0678102 -0.0087204 -0.0315356 0.0491616 -0.0574428 0.0465819 -0.0313118 0.1154814 -0.0408894 0.0907736 0.0131165 0.04328 -0.009107 0.0613729 -0.0824762 -0.0684726 0.1047051 -0.1065027 0.1074218 0.0211122 0.0457595 -0.1419854 0.0766766 -0.0172694 0.0353776 0.0084403 0.0950253 -0.0135288 0.0582268 0.0444371 0.1447213 -0.0157961 -0.1333766 -0.048156 -0.1557123 -0.0194164 -0.0955482 -0.0477851 -0.0287756 -0.0033601 -0.0314011 0.0789845 0.1089624 -0.080991 0.0035108 -0.0610373 -0.0395639 0.0647921 -0.0055005 0.0561383 0.0958462 0.0664009 0.0432629 -0.0988431 0.0335401 0.0698231 0.0493136 -0.0920566 0.063272 0.0501596 0.0126245 0.0253984 -0.1085286 0.0382431 0.0539127 0.0884716 -0.1239487 0.0870343 0.0227129 0.0733738 -0.0691626 -0.0099142 -0.0933868 -0.0739482 0.0864744 -0.0124954 0.0867166 0.0954763 -0.0461738 -0.0975206 -0.0879865 -0.1034332 0.0604614 -0.0113319 -0.0977127 -0.0109633 0.098648 unknown
polarizability: 151.5267942|16.9507781|113.7681894|13.8765653|-10.1985311|98.1707415 unknown
InChI: InChI=1S/C10H14S/c1-2-3-9-11-10-7-5-4-6-8-10/h4-8H,2-3,9H2,1H3
charge 0 multiplicity 1
25 atoms
S  0.585503 1.324711 1.201478
C  2.288256 0.121416 -0.804616
C  3.326881 -0.449645 0.185778
C  1.674309 1.459759 -0.362963
C  3.909595 -1.801039 -0.280418
C  -0.903129 0.496458 0.489205
C  -1.693859 1.144092 -0.49099
C  -1.284269 -0.776923 0.97588
C  -2.852113 0.510225 -0.995014
C  -2.455411 -1.399429 0.48234
C  -3.237823 -0.761549 -0.507763
H  1.477953 -0.61716 -0.966787
H  2.773433 0.27684 -1.792366
H  4.147737 0.285563 0.315525
H  2.848139 -0.565904 1.177501
H  2.451757 2.193308 -0.082033
H  1.04352 1.902483 -1.152451
H  4.655158 -2.187778 0.438382
H  4.40747 -1.70423 -1.26411
H  3.112336 -2.561424 -0.382137
H  -1.416077 2.144252 -0.842258
H  -0.666272 -1.272863 1.731565
H  -3.459728 1.015631 -1.754123
H  -2.748115 -2.383373 0.865771
H  -4.141249 -1.24742 -0.892795
