program: Gaussian 09
title: 000136916
version: EM64L-G09RevD.01
frameworkgroup: C1[X(C16H22Si2)]
method: RPBEPBE
basis: SDD
operation: Freq
keyword: #p
keyword: freq=noraman
keyword: PBEPBE/SDD
title: #p freq=noraman PBEPBE/SDD
converged: YES YES NO NO
title: Mulliken charges:
elementType: Si Si C C C C C C C C C C C C C C C C H H H H H H H H H H H H H H H H H H H H H H
charge: 0.877997 0.877987 -0.126623 -0.126603 -1.016003 -0.990746 -1.016017 -0.990736 -0.316740 -0.316762 -0.301126 -0.301133 -0.232827 -0.232823 -0.245291 -0.245291 -0.239510 -0.239512 0.234245 0.246361 0.241722 0.231747 0.244066 0.247056 0.241724 0.234250 0.246359 0.247058 0.231742 0.244067 0.229570 0.229584 0.236934 0.236946 0.224285 0.224284 0.227524 0.227525 0.227355 0.227355
chargesum: 0.00000
title: Mulliken charges with hydrogens summed into heavy atoms:
elementType: Si Si C C C C C C C C C C C C C C C C
charge: 0.877997 0.877987 -0.126623 -0.126603 -0.293675 -0.267878 -0.293684 -0.267869 -0.087169 -0.087178 -0.064192 -0.064187 -0.008542 -0.008538 -0.017766 -0.017766 -0.012155 -0.012157
polarizability: 2.49228456e+02 4.14653844e-03 2.48118229e+02 -3.26056064e+01 3.48189077e-03 1.65174273e+02
1716.lowfreq: -10.1097 -0.0017 -0.0013 0.0009 7.7703 13.3508 21.4164 31.1293 36.1350
frequency: 19.0483 29.2520 35.6803 50.8611 61.1659 95.2566 108.1913 119.4242 122.0415 131.8836 138.8317 149.7186 153.1043 164.5296 168.4866 181.1610 194.2319 196.4795 244.7259 289.2713 293.1476 322.9060 378.0447 393.2442 396.5414 427.7418 476.9288 482.5763 614.5542 614.8204 623.6877 637.0982 685.1569 685.7440 698.5119 700.4914 707.2365 710.3968 746.9597 747.0899 786.6370 800.0258 812.4643 812.4904 857.3980 861.2312 865.8645 880.0224 896.0008 905.2426 922.1720 927.6375 979.5879 982.8209 987.2605 987.6803 996.7067 998.5157 1022.9463 1022.9471 1075.7761 1076.0371 1095.3547 1096.2352 1172.4552 1172.5563 1198.1368 1198.3050 1285.9585 1286.1547 1296.7200 1299.4110 1310.0520 1311.2105 1363.3044 1363.6092 1417.5769 1417.9221 1442.0623 1444.6125 1444.7024 1448.4071 1452.1173 1452.5307 1453.7198 1458.0977 1469.8161 1471.1797 1575.1393 1575.7032 1594.7370 1594.8317 2977.5321 2977.7234 2980.6756 2980.8804 3079.7471 3079.8770 3082.7924 3083.4299 3084.1224 3084.4109 3088.6719 3088.7331 3112.4147 3112.6601 3114.5824 3115.5386 3128.7048 3129.1382 3138.8733 3139.3909 3157.5124 3157.8147
redmass: 4.4531 3.6944 4.1778 3.7863 3.8251 2.9079 3.0962 2.9366 2.2205 1.0658 1.0512 1.2346 1.5185 2.0090 2.4470 3.0231 2.5908 2.9551 3.7603 4.3540 4.4144 5.1392 6.1991 2.7753 2.8116 5.9319 3.4182 3.4461 6.4350 6.4358 4.8331 4.7343 5.4660 5.3825 3.2037 3.1370 1.7500 1.8980 1.6463 1.7882 1.3405 1.4684 1.3567 1.2690 1.3286 1.3076 1.2456 1.4377 1.4021 1.4448 1.3617 1.3635 1.4067 1.4503 5.2147 6.0759 1.3073 1.3005 3.0481 3.0496 1.7222 1.7219 2.7443 2.7372 1.0562 1.0561 1.1305 1.1299 1.2077 1.2079 1.1883 1.1844 1.4520 1.4491 4.4295 4.4392 2.1315 2.1384 1.0570 1.0561 1.0587 1.0538 1.0513 1.0573 1.0767 1.0801 1.9062 1.8765 5.4526 5.4559 5.7813 5.7774 1.0338 1.0338 1.0336 1.0335 1.0988 1.0988 1.0984 1.0985 1.0982 1.0983 1.0983 1.0984 1.0845 1.0845 1.0869 1.0868 1.0912 1.0913 1.0960 1.0959 1.1015 1.1015
irintensity: 0.0003 0.0134 0.0075 0.0086 0.0238 0.3543 0.1626 0.0399 0.0096 0.0270 0.1413 0.0357 0.0797 0.0016 0.3619 0.3004 0.4172 0.2067 19.1571 1.6746 6.5959 4.0650 15.0604 0.1736 0.0261 4.0369 41.1441 0.0015 0.0064 0.1099 13.5461 9.4537 2.7825 3.2235 6.1537 13.7168 102.0830 3.5813 0.0440 74.4545 16.9617 7.4824 22.7140 2.7935 141.1724 135.2890 0.0408 47.0877 62.6300 66.5591 0.1953 0.0082 0.1751 0.0431 0.7876 0.2522 0.0306 0.0000 1.3699 1.4178 0.8275 4.2035 26.5454 12.2072 0.2346 0.1045 0.6267 0.2455 25.1411 24.9929 31.4532 16.4073 8.7843 19.9867 0.4846 1.2281 6.9164 17.4394 5.7670 7.4196 0.3795 15.0684 12.3014 7.3439 3.7247 15.3208 7.3784 3.2408 0.0378 0.1179 0.2401 1.6193 13.1282 22.8635 30.7627 2.7112 25.0135 0.0313 16.7499 0.0223 18.6382 32.3600 21.1646 8.7437 4.3407 5.9949 4.8563 0.3881 4.5248 12.5376 69.9848 26.9145 32.5195 36.6752
temp: 298.150 k
press: 1.00000 atm
elementType: 14 14 6 6 6 6 6 6 6 6 6 6 6 6 6 6 6 6 1 1 1 1 1 1 1 1 1 1 1 1 1 1 1 1 1 1 1 1 1 1
symmnumber: 1
zpe: 858389.6 jmol-1
zpe.correction: 0.326943 hartree
zpe.thermalcorrener: 0.348842 hartree
zpe.thermalcorrenthalpy: 0.349786 hartree
zpe.thermalcorrgfe: 0.274488 hartree
zpe.sumelectzpe: -1200.393534 hartree
zpe.sumelectthermal: -1200.371635 hartree
zpe.sumelectthermalent: -1200.370691 hartree
zpe.sumelectthermalfe: -1200.445990 hartree
dipole: 0.0000 -0.2797 0.0000
dipole: 0.2797
quadrupole: -119.7692 -114.1954 -126.4163
quadrupole: 0.0010 -6.8103 0.0008
quadrupole: 0.3578 5.9316 -6.2894 0.0010 -6.8103 0.0008
hfenergy: -1200.7204772 hartree
pointgroup: C01 [X(C16H22Si2)]
dipole: -0.0000083 -0.1100268 -0.0000171 debye
polarizability: 248.6509177|-0.0007816|248.1182284|-33.3367154|0.0035228|165.751812 unknown
InChI: InChI=1S/2C8H11Si/c2*1-9(2)8-6-4-3-5-7-8/h2*3-7H,1-2H3
charge 0 multiplicity 1
40 atoms
Si -0.983987 -1.626213 -0.703037
Si 0.984206 -1.626263 0.702683
C  -2.064627 -0.097881 -0.278238
C  2.064681 -0.097719 0.278229
C  -1.991755 -3.229564 -0.385305
C  -0.449808 -1.539514 -2.543939
C  1.99215 -3.229438 0.384616
C  0.450027 -1.539998 2.543607
C  -3.258729 -0.220332 0.486678
C  3.259007 -0.219904 -0.48638
C  -1.689884 1.205052 -0.715712
C  1.689594 1.205117 0.715701
C  -4.049226 0.909667 0.801955
C  4.049391 0.910257 -0.801361
C  -2.476741 2.337687 -0.405219
C  2.476335 2.337911 0.405501
C  -3.660239 2.193826 0.356233
C  3.660063 2.194314 -0.355645
H  -2.271169 -3.335492 0.678943
H  -2.919836 -3.237486 -0.987393
H  -1.396393 -4.117802 -0.665706
H  0.168849 -2.414981 -2.814405
H  -1.334387 -1.522822 -3.207386
H  0.147137 -0.631166 -2.742612
H  1.396887 -4.117798 0.66484
H  2.271569 -3.335115 -0.679655
H  2.920235 -3.237386 0.986698
H  -0.146931 -0.631702 2.742477
H  -0.168608 -2.415536 2.813893
H  1.334611 -1.523425 3.20705
H  -3.584613 -1.207737 0.837177
H  3.585155 -1.207225 -0.836869
H  -0.774075 1.342034 -1.304733
H  0.773609 1.341897 1.304493
H  -4.96642 0.787273 1.390117
H  4.966762 0.788065 -1.389289
H  -2.167482 3.328725 -0.757693
H  2.166809 3.328869 0.757966
H  -4.272294 3.070847 0.596713
H  4.27203 3.071459 -0.595895
