program: Gaussian 09
title: 000136913
version: EM64L-G09RevD.01
frameworkgroup: C1[X(C14H24)]
method: RPBEPBE
basis: SDD
operation: Freq
keyword: #p
keyword: freq=noraman
keyword: PBEPBE/SDD
title: #p freq=noraman PBEPBE/SDD
converged: YES YES NO NO
title: Mulliken charges:
elementType: C C C C C C C C C C C C C C H H H H H H H H H H H H H H H H H H H H H H H H
charge: 0.112752 0.112753 0.139575 0.139571 -0.723443 -0.723395 -0.723442 -0.723402 0.184257 0.184281 -0.812639 -0.785729 -0.812652 -0.785731 0.202635 0.205064 0.219850 0.202600 0.219827 0.205056 0.219845 0.202634 0.205066 0.219828 0.205040 0.202609 0.225479 0.225468 0.234432 0.220699 0.223764 0.223747 0.225479 0.225474 0.234439 0.220699 0.223766 0.223745
chargesum: 0.00000
title: Mulliken charges with hydrogens summed into heavy atoms:
elementType: C C C C C C C C C C C C C C
charge: 0.112752 0.112753 0.139575 0.139571 -0.095895 -0.095912 -0.095897 -0.095925 0.184257 0.184281 -0.127259 -0.117519 -0.127260 -0.117522
polarizability: 1.94132292e+02 -8.09225958e-04 1.63341685e+02 -5.93385379e-03 3.56139769e-04 1.14301949e+02
1716.lowfreq: -208.9365 -59.6750 -11.9020 -5.1030 -0.0006 -0.0004 -0.0003 13.3575 24.2275
frequency: -208.8833 -59.4749 24.0594 84.2354 115.3282 119.3596 133.5063 165.1706 186.6506 199.3140 200.6450 202.0823 263.6103 268.1346 268.5008 272.3238 290.9564 294.0358 311.4555 343.8528 346.1075 371.7463 376.3808 410.4842 433.7633 440.0133 535.7942 542.6668 563.0318 616.7210 703.8458 708.4417 781.2683 865.6685 901.2276 920.3869 933.0628 946.5962 948.6569 949.8894 954.6624 973.1654 976.2297 986.9706 992.9259 1031.5684 1063.4673 1069.9101 1082.2871 1129.8270 1147.4971 1151.4337 1177.8792 1210.4518 1213.5339 1227.4013 1252.5591 1263.0970 1366.4098 1372.8207 1379.4701 1379.6785 1384.7340 1393.0359 1394.2801 1402.7823 1446.9558 1452.2287 1453.9373 1458.8105 1462.2158 1465.6458 1466.0367 1474.9766 1476.7130 1478.4425 1480.1145 1485.0573 1490.7755 1492.2600 1499.7497 1501.8015 1653.5321 1671.6232 2954.8257 2955.5346 2973.1607 2975.8722 2978.2769 2983.6063 2984.7989 2998.8474 3014.5039 3014.5197 3058.5622 3062.7885 3063.5105 3068.9931 3074.4805 3076.0532 3077.1160 3082.2862 3085.2711 3089.8371 3093.0302 3098.5166 3138.9341 3139.1294
redmass: 1.0157 2.6998 2.4565 1.8596 1.0979 2.0409 1.2356 1.3854 1.8370 1.2912 1.1104 3.0458 1.6004 1.1715 1.1357 2.8083 2.9221 2.5646 2.4806 2.6032 2.7059 2.6572 2.8230 2.3065 2.9381 2.5021 3.0215 3.9589 3.0802 2.3462 2.7200 5.4820 4.7420 2.6314 2.4012 1.4072 1.4681 1.2323 1.9304 1.2618 1.6256 1.3824 1.7054 1.2401 1.3058 2.0422 1.6245 1.6301 1.7612 3.9221 2.9876 2.2061 2.4316 3.7600 4.8342 3.6537 4.2986 4.5249 1.2117 1.1932 1.1857 1.2154 1.2184 1.2011 1.1990 1.1825 1.0506 1.0891 1.0489 1.0519 1.0485 1.0500 1.0795 1.0596 1.0497 1.0620 1.0487 1.0497 1.0488 1.0595 1.0562 1.0521 7.9138 7.8633 1.0421 1.0420 1.0363 1.0366 1.0364 1.0366 1.0359 1.0361 1.0965 1.0965 1.0977 1.0972 1.0974 1.0968 1.0988 1.1001 1.1006 1.0995 1.0973 1.0986 1.0981 1.0978 1.0909 1.0909
irintensity: 0.0000 0.0000 0.0000 0.6420 0.0000 3.9336 0.0958 0.0000 0.0830 0.0151 0.0004 0.0248 0.0001 0.0631 0.0286 0.0073 0.1256 0.1191 0.2122 0.2258 0.0001 0.1741 8.9375 1.6866 0.0000 0.5451 1.9251 0.2136 0.5963 1.1213 0.1192 0.0000 0.9256 4.0728 0.0582 0.0000 0.8330 0.0514 0.0390 0.0000 0.1127 10.8415 9.6618 0.4631 0.0000 25.1859 0.0000 5.9904 25.3973 8.2230 5.3004 7.5093 11.1969 0.1494 0.0000 1.2551 1.0862 10.8574 0.0000 11.3130 37.6099 7.5674 2.4654 17.0238 26.7566 3.1831 0.0000 27.0606 0.0001 7.9782 3.7517 0.0388 17.3996 3.2022 1.1674 14.8920 0.0008 37.7658 8.6978 17.6261 0.1426 9.2684 14.2061 5.5727 106.5483 8.3066 0.0001 27.8102 55.5180 78.8837 11.2896 60.2926 0.0196 47.6443 0.0006 62.9959 0.1936 74.3554 0.0002 56.7746 0.0010 72.1180 0.7769 44.4291 35.2102 42.3315 3.1892 50.4141
temp: 298.150 k
press: 1.00000 atm
elementType: 6 6 6 6 6 6 6 6 6 6 6 6 6 6 1 1 1 1 1 1 1 1 1 1 1 1 1 1 1 1 1 1 1 1 1 1 1 1
symmnumber: 1
zpe: 885059.4 jmol-1
zpe.correction: 0.337101 hartree
zpe.thermalcorrener: 0.353917 hartree
zpe.thermalcorrenthalpy: 0.354861 hartree
zpe.thermalcorrgfe: 0.294547 hartree
zpe.sumelectzpe: -546.712938 hartree
zpe.sumelectthermal: -546.696122 hartree
zpe.sumelectthermalent: -546.695178 hartree
zpe.sumelectthermalfe: -546.755493 hartree
dipole: 0.0000 0.5102 0.0001
dipole: 0.5102
quadrupole: -85.5115 -85.8352 -90.8391
quadrupole: 0.0001 -0.0010 0.0002
quadrupole: 1.8838 1.5601 -3.4439 0.0001 -0.0010 0.0002
hfenergy: -547.0500394 hartree
pointgroup: C01 [X(C14H24)]
dipole: 0.0002168 -0.2007249 -0.0000137 debye
polarizability: 194.1322571|0.0313188|163.3417159|0.0176893|-0.0060199|114.3019528 unknown
InChI: InChI=1S/C14H24/c1-9(2)11-12(10(3)4)14(7,8)13(11,5)6/h1-8H3
charge 0 multiplicity 1
38 atoms
C  -0.811639 1.231263 0.000378
C  0.80905 1.232929 -0.001046
C  -0.751624 -0.328232 -0.000005
C  0.752236 -0.326691 -0.000109
C  -1.452864 1.858851 1.262773
C  -1.455132 1.859507 -1.260526
C  1.448956 1.861318 -1.263711
C  1.451202 1.863089 1.259584
C  -1.782993 -1.233753 -0.000584
C  1.785437 -1.230118 0.000625
C  -3.240874 -0.796044 -0.000124
C  -1.632864 -2.754841 -0.002024
C  3.242455 -0.78955 0.000073
C  1.63832 -2.751494 0.002412
H  -1.211808 2.936805 1.331939
H  -2.554097 1.771723 1.232668
H  -1.108638 1.368455 2.188969
H  -1.213943 2.937433 -1.329708
H  -1.112782 1.369414 -2.187572
H  -2.556322 1.77264 -1.228369
H  1.105861 1.369735 -2.189699
H  1.205514 2.938703 -1.333404
H  2.550376 1.776634 -1.233506
H  1.110109 1.372522 2.186845
H  2.552594 1.778834 1.227345
H  1.207471 2.940464 1.328408
H  -3.765726 -1.203713 -0.888309
H  -3.765917 -1.206549 0.886636
H  -3.371914 0.293618 0.00163
H  -2.626808 -3.235285 -0.004332
H  -1.091938 -3.117208 -0.89272
H  -1.095178 -3.119271 0.889817
H  3.768156 -1.196353 0.888151
H  3.768238 -1.198898 -0.886785
H  3.371435 0.300362 -0.001489
H  2.633198 -3.230001 0.00478
H  1.098143 -3.114726 0.89321
H  1.101308 -3.117172 -0.889321
